{"text_format":"1","workbook":"xlsx","n_sheets":5,"sheets":["Millwall","Comparisons","Sheet1","Sheet2","Sheet3"],"not_rendered":{"charts":1,"images":3,"macros":1,"external_links":4,"defined_names":13,"comments":0,"pivot_tables":0},"unopened":[],"bounds":{"document_bytes":16777216,"sheet_cells":100000,"rows_first":2000,"rows_last":500,"rows_between":2000,"halvings":0,"cell_chars":16384,"cell_head_chars":4096},"cells_cut":0,"cells_raw":0,"read":"whole","date_system":"1900"}

{"sheet":"Millwall","index":0,"n_rows":136,"n_cols":141,"rows_kept":136,"cut":false,"hidden":false,"merged":[[50,70,50,71],[50,73,50,74],[50,67,50,68],[4,64,4,65],[2,82,2,85],[3,66,3,68],[3,70,3,72],[3,74,3,76],[3,78,3,80],[3,82,3,84],[2,66,2,69],[2,70,2,73],[2,74,2,77],[2,78,2,81]]}
[null,null,1]
[]
[null,null,null,null,null,null,null,null,null,null,null,null,null,null,null,null,null,null,null,null,null,null,null,null,null,null,null,null,null,null,null,null,null,null,null,null,null,null,null,null,null,null,null,null,null,null,null,null,null,null,null,null,null,null,null,null,"Check with Complete History 2010",null,null,null,null,null,null,null,null,null,"All",null,null,null,"Division Two",null,null,null,"FA Cup",null,null,null,"League Cup",null,null,null,"LDV Trophy"]
[null,null,"Game","Competition","Date",null,"Us & Them","Opponents",null,"Score","HT","Att","Pts","Pos","Goal Scorers",null,null,null,null,"Game","Competition","Date","Opponents",null,"Score",1,2,3,4,5,6,7,8,9,10,11,null,null,12,null,null,null,null,null,null,null,null,null,null,null,null,null,null,null,null,null,null,null,null,null,null,null,null,null,null,null,{"$f":"\"Max (\"&BM100&\")\"","v":"Max (46)"},null,null,null,{"$f":"\"Max (\"&BM97&\")\"","v":"Max (42)"},null,null,null,{"$f":"\"Max (\"&BM99&\")\"","v":"Max (3)"},null,null,null,{"$f":"\"Max (\"&BM98&\")\"","v":"Max (1)"},null,null,null,"Max (2)",null,null,null,null,null,null,null,null,null,null,null,null,null,null,null,null,null,null,null,null,null,null,null,null,null,null,null,null,null,null,null,null,null,null,null,null,null,null,null,null,null,null,null,null,null,null,null,null,null,null,null,null,null,null,null,"Opposition","Pts","Pos"]
[1,null,1,"Division 2","1974-08-17",null,"-","Sunderland","(H)","L 1-4","1-2",10572,0,19,"Saul / Kerr , Towers, Halom , Hughes",1,1,null,null,1,"Division 2","1974-08-17","Sunderland","(H)","L 1-4","King","B Brown","Cripps","Donaldson","Dorney","Allder","Saul","Smethurst","Wood","Clark","Hill",null,null,"-",null,null,null,null,null,null,null,null,null,null,null,null,null,null,null,null,null,"Apps","Sub","Apps","Sub","Apps","Sub",null,null,"Player  ",null,"Apps","Sub","NPS","Goals","Apps","Sub","NPS","Goals","Apps","Sub","NPS","Goals","Apps","Sub","NPS","Goals","Apps","Sub","Nps","Goals",null,null,null,null,null,null,null,null,null,null,null,null,null,null,null,null,null,null,null,null,null,null,null,null,null,null,null,null,null,null,null,null,null,null,null,null,null,null,null,null,null,null,null,null,null,null,null,null,null,null,null,null,"Sunderland (H) L 1-4",0,19]
[{"$f":"IF(A5=0,1,IF(A5=2,1,2))","v":2},null,2,"Division 2","1974-08-19",null,"22nd v 15th","Nottm Forest","(H)","W 3-0","1-0",7509,2,7,"Hill (2) , M Kelly",2,{"$f":"IF(Q5=0,1,IF(Q5=2,1,2))","v":2},null,null,2,"Division 2","1974-08-19","Nottm Forest","(H)","W 3-0","King","Donaldson","B Brown","Dorney","Kitchener","Saul","Smethurst","Wood","Clark","M Kelly","Hill",null,null,"S Brown",null,null,null,null,null,null,null,null,null,null,null,null,null,null,null,null,{"$f":"IF(BE6=BS6,IF(BF6=BT6,IF(BG6=BW6,IF(BH6=BX6,IF(BI6=CA6,IF(BJ6=CB6,\"OK\",\"Error\"),\"Error\"),\"Error\"),\"Error\"),\"Error\"),\"Error\")","v":"OK"},26,5,2,1,0,0,1,null,"Doug Allder",null,{"$f":"BS6+BW6+CA6+CE6","v":28},{"$f":"BT6+BX6+CB6+CF6","v":6},0,{"$f":"BV6+BZ6+CD6+CH6","v":1},{"$f":"$BP$53","v":26},{"$f":"$BR$53","v":5},0,1,{"$f":"$BS$53","v":2},{"$f":"$BT$53","v":1},0,0,{"$f":"$BV$53","v":0},{"$f":"$BW$53","v":0},0,0,null,null,null,null,null,6,null,null,null,null,null,null,null,null,null,null,null,null,null,null,null,null,null,null,null,null,null,null,null,null,null,null,null,null,null,null,null,null,null,null,null,null,null,null,null,null,null,null,null,null,null,null,null,null,null,null,"Nottm Forest (H) W 3-0",2,7]
{"$rows_left_out":131}
{"sheet":"Comparisons","index":1,"n_rows":265,"n_cols":99,"rows_kept":265,"cut":false,"hidden":false,"merged":[]}
[]
[null,null,null,null,null,null,null,null,null,null,{"$f":"IF(K3=0,0,1)","v":1},{"$f":"IF(L3=0,0,1)","v":1},1,1,1,1,1,1,1,1,1,1,1,1,1,1,1,1,1,1,1,1,1,1,1,0,0,0,0,0,0,0,0,0,null,null,null,null,null,null,null,null,null,null,null,null,null,null,null,null,null,null,null,null,null,null,null,null,null,null,null,{"$f":"IF(BT3=0,0,1)","v":1},1,1,1,1,1,1,1,1,1,1,1]
["Formulas",null,null,null,null,"Date",null,"Opponents","Venue / Result",null,{"$f":"$CM$5","v":"Allder"},{"$f":"$CM$6","v":"Baldwin"},{"$f":"$CM$7","v":"Bolland"},{"$f":"$CM$8","v":"B Brown"},{"$f":"$CM$9","v":"S Brown"},{"$f":"$CM$10","v":"Burnett"},{"$f":"$CM$11","v":"Clark"},{"$f":"$CM$12","v":"Cripps"},{"$f":"$CM$13","v":"Dillon"},{"$f":"$CM$14","v":"Donaldson"},{"$f":"$CM$15","v":"Dorney"},{"$f":"$CM$16","v":"Evans"},{"$f":"$CM$17","v":"Hazell"},{"$f":"$CM$18","v":"Hill"},{"$f":"$CM$19","v":"Jones"},{"$f":"$CM$20","v":"C Kelly"},{"$f":"$CM$21","v":"M Kelly"},{"$f":"$CM$22","v":"King"},{"$f":"$CM$23","v":"Kitchener"},{"$f":"$CM$24","v":"Moore"},{"$f":"$CM$25","v":"Saul"},{"$f":"$CM$26","v":"Smethurst"},{"$f":"$CM$27","v":"Smith"},{"$f":"$CM$28","v":"Summerill"},{"$f":"$CM$29","v":"Wood"},{"$f":"$CM$30","v":0},{"$f":"$CM$31","v":0},{"$f":"$CM$32","v":0},{"$f":"$CM$33","v":0},{"$f":"$CM$34","v":0},{"$f":"$CM$35","v":0},{"$f":"$CM$36","v":0},{"$f":"$CM$37","v":0},{"$f":"$CM$38","v":0},null,null,null,null,null,{"$f":"Millwall!$BN53&\" (**\"","v":"Allder (**"},{"$f":"Millwall!$BN54&\" (**\"","v":"Baldwin (**"},{"$f":"Millwall!$BN55&\" (**\"","v":"Bolland (**"},{"$f":"Millwall!$BN56&\" (**\"","v":"B Brown (**"},{"$f":"Millwall!$BN57&\" (**\"","v":"S Brown (**"},{"$f":"Millwall!$BN58&\" (**\"","v":"Burnett (**"},{"$f":"Millwall!$BN59&\" (**\"","v":"Clark (**"},{"$f":"Millwall!$BN60&\" (**\"","v":"Cripps (**"},{"$f":"Millwall!$BN61&\" (**\"","v":"Dillon (**"},{"$f":"Millwall!$BN62&\" (**\"","v":"Donaldson (**"},{"$f":"Millwall!$BN63&\" (**\"","v":"Dorney (**"},{"$f":"Millwall!$BN64&\" (**\"","v":"Evans (**"},{"$f":"Millwall!$BN65&\" (**\"","v":"Hazell (**"},{"$f":"Millwall!$BN66&\" (**\"","v":"Hill (**"},{"$f":"Millwall!$BN67&\" (**\"","v":"Jones (**"},{"$f":"Millwall!$BN68&\" (**\"","v":"C Kelly (**"},{"$f":"Millwall!$BN69&\" (**\"","v":"M Kelly (**"},{"$f":"Millwall!$BN70&\" (**\"","v":"King (**"},{"$f":"Millwall!$BN71&\" (**\"","v":"Kitchener (**"},{"$f":"Millwall!$BN72&\" (**\"","v":"Moore (**"},{"$f":"Millwall!$BN73&\" (**\"","v":"Saul (**"},{"$f":"Millwall!$BN74&\" (**\"","v":"Smethurst (**"},{"$f":"Millwall!$BN75&\" (**\"","v":"Smith (**"},{"$f":"Millwall!$BN76&\" (**\"","v":"Summerill (**"},{"$f":"Millwall!$BN77&\" (**\"","v":"Wood (**"},{"$f":"Millwall!$BN78&\" (**\"","v":" (**"},{"$f":"Millwall!$BN79&\" (**\"","v":" (**"},{"$f":"Millwall!$BN80&\" (**\"","v":" (**"},{"$f":"Millwall!$BN81&\" (**\"","v":" (**"},{"$f":"Millwall!$BN82&\" (**\"","v":" (**"},{"$f":"Millwall!$BN83&\" (**\"","v":" (**"},{"$f":"Millwall!$BN84&\" (**\"","v":" (**"},{"$f":"Millwall!$BN85&\" (**\"","v":" (**"},{"$f":"Millwall!$BN86&\" (**\"","v":" (**"}]
[null,null,1,null,null,null,null,null,null,null,{"$f":"$CO$5","v":"Allder**"},{"$f":"$CO$6","v":"Baldwin**"},{"$f":"$CO$7","v":"Bolland**"},{"$f":"$CO$8","v":"B Brown**"},{"$f":"$CO$9","v":"S Brown**"},{"$f":"$CO$10","v":"Burnett**"},{"$f":"$CO$11","v":"Clark**"},{"$f":"$CO$12","v":"Cripps**"},{"$f":"$CO$13","v":"Dillon**"},{"$f":"$CO$14","v":"Donaldson**"},{"$f":"$CO$15","v":"Dorney**"},{"$f":"$CO$16","v":"Evans**"},{"$f":"$CO$17","v":"Hazell**"},{"$f":"$CO$18","v":"Hill**"},{"$f":"$CO$19","v":"Jones**"},{"$f":"$CO$20","v":"C Kelly**"},{"$f":"$CO$21","v":"M Kelly**"},{"$f":"$CO$22","v":"King**"},{"$f":"$CO$23","v":"Kitchener**"},{"$f":"$CO$24","v":"Moore**"},{"$f":"$CO$25","v":"Saul**"},{"$f":"$CO$26","v":"Smethurst**"},{"$f":"$CO$27","v":"Smith**"},{"$f":"$CO$28","v":"Summerill**"},{"$f":"$CO$29","v":"Wood**"},{"$f":"$CO$30","v":"**"},{"$f":"$CO$31","v":"**"},{"$f":"$CO$32","v":"**"},{"$f":"$CO$33","v":"**"},{"$f":"$CO$34","v":"**"},{"$f":"$CO$35","v":"**"},{"$f":"$CO$36","v":"**"},{"$f":"$CO$37","v":"**"},{"$f":"$CO$38","v":"**"},null,null,null,null,null,"Allder**","Baldwin**","Bolland**","B Brown**","S Brown**","Burnett**","Clark**","Cripps**","Dillon**","Donaldson**","Dorney**","Evans**","Hazell**","Hill**","Jones**","C Kelly**","M Kelly**","King**","Kitchener**","Moore**","Saul**","Smethurst**","Smith**","Summerill**","Wood**","**","**","**","**","**","**","**","**","**"]
[null,null,{"$f":"IF(J5=0,1,0)","v":0},1,null,{"$f":"Millwall!V75","v":"1974-08-17"},null,{"$f":"Millwall!W75","v":"Sunderland"},{"$f":"Millwall!X75","v":"(H)"},{"$f":"Millwall!Y75","v":"L 1-4"},{"$f":"MATCH(K$4,Millwall!$Z75:$AK75,0)","v":6},{"$f":"MATCH(L$4,Millwall!$Z75:$AK75,0)","v":{"$error":"#N/A"}},{"$f":"MATCH(M$4,Millwall!$Z75:$AK75,0)","v":{"$error":"#N/A"}},{"$f":"MATCH(N$4,Millwall!$Z75:$AK75,0)","v":2},{"$f":"MATCH(O$4,Millwall!$Z75:$AK75,0)","v":{"$error":"#N/A"}},{"$f":"MATCH(P$4,Millwall!$Z75:$AK75,0)","v":{"$error":"#N/A"}},{"$f":"MATCH(Q$4,Millwall!$Z75:$AK75,0)","v":10},{"$f":"MATCH(R$4,Millwall!$Z75:$AK75,0)","v":3},{"$f":"MATCH(S$4,Millwall!$Z75:$AK75,0)","v":{"$error":"#N/A"}},{"$f":"MATCH(T$4,Millwall!$Z75:$AK75,0)","v":4},{"$f":"MATCH(U$4,Millwall!$Z75:$AK75,0)","v":5},{"$f":"MATCH(V$4,Millwall!$Z75:$AK75,0)","v":{"$error":"#N/A"}},{"$f":"MATCH(W$4,Millwall!$Z75:$AK75,0)","v":{"$error":"#N/A"}},{"$f":"MATCH(X$4,Millwall!$Z75:$AK75,0)","v":11},{"$f":"MATCH(Y$4,Millwall!$Z75:$AK75,0)","v":{"$error":"#N/A"}},{"$f":"MATCH(Z$4,Millwall!$Z75:$AK75,0)","v":{"$error":"#N/A"}},{"$f":"MATCH(AA$4,Millwall!$Z75:$AK75,0)","v":{"$error":"#N/A"}},{"$f":"MATCH(AB$4,Millwall!$Z75:$AK75,0)","v":1},{"$f":"MATCH(AC$4,Millwall!$Z75:$AK75,0)","v":{"$error":"#N/A"}},{"$f":"MATCH(AD$4,Millwall!$Z75:$AK75,0)","v":{"$error":"#N/A"}},{"$f":"MATCH(AE$4,Millwall!$Z75:$AK75,0)","v":7},{"$f":"MATCH(AF$4,Millwall!$Z75:$AK75,0)","v":8},{"$f":"MATCH(AG$4,Millwall!$Z75:$AK75,0)","v":{"$error":"#N/A"}},{"$f":"MATCH(AH$3,Millwall!$Z75:$AK75,0)","v":{"$error":"#N/A"}},{"$f":"MATCH(AI$3,Millwall!$Z75:$AK75,0)","v":9},{"$f":"MATCH(AJ$3,Millwall!$Z75:$AK75,0)","v":{"$error":"#N/A"}},{"$f":"MATCH(AK$3,Millwall!$Z75:$AK75,0)","v":{"$error":"#N/A"}},{"$f":"MATCH(AL$3,Millwall!$Z75:$AK75,0)","v":{"$error":"#N/A"}},{"$f":"MATCH(AM$3,Millwall!$Z75:$AK75,0)","v":{"$error":"#N/A"}},{"$f":"MATCH(AN$3,Millwall!$Z75:$AK75,0)","v":{"$error":"#N/A"}},{"$f":"MATCH(AO$3,Millwall!$Z75:$AK75,0)","v":{"$error":"#N/A"}},{"$f":"MATCH(AP$3,Millwall!$Z75:$AK75,0)","v":{"$error":"#N/A"}},{"$f":"MATCH(AQ$3,Millwall!$Z75:$AK75,0)","v":{"$error":"#N/A"}},{"$f":"MATCH(AR$3,Millwall!$Z75:$AK75,0)","v":{"$error":"#N/A"}},null,null,null,null,null,{"$f":"MATCH(AX$3,Millwall!$Z75:AK75,0)","v":{"$error":"#N/A"}},{"$f":"MATCH(AY$3,Millwall!$Z75:AK75,0)","v":{"$error":"#N/A"}},{"$f":"MATCH(AZ$3,Millwall!$Z75:AK75,0)","v":{"$error":"#N/A"}},{"$f":"MATCH(BA$3,Millwall!$Z75:AK75,0)","v":{"$error":"#N/A"}},{"$f":"MATCH(BB$3,Millwall!$Z75:AK75,0)","v":{"$error":"#N/A"}},{"$f":"MATCH(BC$3,Millwall!$Z75:AK75,0)","v":{"$error":"#N/A"}},{"$f":"MATCH(BD$3,Millwall!$Z75:AK75,0)","v":{"$error":"#N/A"}},{"$f":"MATCH(BE$3,Millwall!$Z75:AK75,0)","v":{"$error":"#N/A"}},{"$f":"MATCH(BF$3,Millwall!$Z75:AK75,0)","v":{"$error":"#N/A"}},{"$f":"MATCH(BG$3,Millwall!$Z75:AK75,0)","v":{"$error":"#N/A"}},{"$f":"MATCH(BH$3,Millwall!$Z75:AK75,0)","v":{"$error":"#N/A"}},{"$f":"MATCH(BI$3,Millwall!$Z75:AK75,0)","v":{"$error":"#N/A"}},{"$f":"MATCH(BJ$3,Millwall!$Z75:AK75,0)","v":{"$error":"#N/A"}},{"$f":"MATCH(BK$3,Millwall!$Z75:AK75,0)","v":{"$error":"#N/A"}},{"$f":"MATCH(BL$3,Millwall!$Z75:AK75,0)","v":{"$error":"#N/A"}},{"$f":"MATCH(BM$3,Millwall!$Z75:AK75,0)","v":{"$error":"#N/A"}},{"$f":"MATCH(BN$3,Millwall!$Z75:AK75,0)","v":{"$error":"#N/A"}},{"$f":"MATCH(BO$3,Millwall!$Z75:AK75,0)","v":{"$error":"#N/A"}},{"$f":"MATCH(BP$3,Millwall!$Z75:AK75,0)","v":{"$error":"#N/A"}},{"$f":"MATCH(BQ$3,Millwall!$Z75:AK75,0)","v":{"$error":"#N/A"}},{"$f":"MATCH(BR$3,Millwall!$Z75:AK75,0)","v":{"$error":"#N/A"}},{"$f":"MATCH(BS$3,Millwall!$Z75:AK75,0)","v":{"$error":"#N/A"}},{"$f":"MATCH(BT$3,Millwall!$Z75:AK75,0)","v":{"$error":"#N/A"}},{"$f":"MATCH(BU$3,Millwall!$Z75:AK75,0)","v":{"$error":"#N/A"}},{"$f":"MATCH(BV$3,Millwall!$Z75:AK75,0)","v":{"$error":"#N/A"}},{"$f":"MATCH(BW$3,Millwall!$Z75:AK75,0)","v":{"$error":"#N/A"}},{"$f":"MATCH(BX$3,Millwall!$Z75:AK75,0)","v":{"$error":"#N/A"}},{"$f":"MATCH(BY$3,Millwall!$Z75:AK75,0)","v":{"$error":"#N/A"}},{"$f":"MATCH(BZ$3,Millwall!$Z75:AK75,0)","v":{"$error":"#N/A"}},{"$f":"MATCH(CA$3,Millwall!$Z75:AK75,0)","v":{"$error":"#N/A"}},{"$f":"MATCH(CB$3,Millwall!$Z75:AK75,0)","v":{"$error":"#N/A"}},{"$f":"MATCH(CC$3,Millwall!$Z75:AK75,0)","v":{"$error":"#N/A"}},{"$f":"MATCH(CD$3,Millwall!$Z75:AK75,0)","v":{"$error":"#N/A"}},{"$f":"MATCH(CE$3,Millwall!$Z75:AK75,0)","v":{"$error":"#N/A"}},null,null,null,null,null,null,null,{"$f":"Millwall!$BN53","v":"Allder"},{"$f":"Millwall!$BN53&\" (**\"","v":"Allder (**"},{"$f":"Millwall!$BN53&\"**\"","v":"Allder**"},null,{"$f":"$CM$5","v":"Allder"},{"$f":"$CN$5","v":"Allder (**"},{"$f":"$CO$5","v":"Allder**"},null,{"$f":"Millwall!$BV$6","v":1}]
[null,null,0,2,null,{"$f":"Millwall!V76","v":"1974-08-19"},null,{"$f":"Millwall!W76","v":"Nottm Forest"},{"$f":"Millwall!X76","v":"(H)"},{"$f":"Millwall!Y76","v":"W 3-0"},{"$f":"MATCH(K$4,Millwall!$Z76:$AK76,0)","v":{"$error":"#N/A"}},{"$f":"MATCH(L$4,Millwall!$Z76:$AK76,0)","v":{"$error":"#N/A"}},{"$f":"MATCH(M$4,Millwall!$Z76:$AK76,0)","v":{"$error":"#N/A"}},{"$f":"MATCH(N$4,Millwall!$Z76:$AK76,0)","v":3},{"$f":"MATCH(O$4,Millwall!$Z76:$AK76,0)","v":12},{"$f":"MATCH(P$4,Millwall!$Z76:$AK76,0)","v":{"$error":"#N/A"}},{"$f":"MATCH(Q$4,Millwall!$Z76:$AK76,0)","v":9},{"$f":"MATCH(R$4,Millwall!$Z76:$AK76,0)","v":{"$error":"#N/A"}},{"$f":"MATCH(S$4,Millwall!$Z76:$AK76,0)","v":{"$error":"#N/A"}},{"$f":"MATCH(T$4,Millwall!$Z76:$AK76,0)","v":2},{"$f":"MATCH(U$4,Millwall!$Z76:$AK76,0)","v":4},{"$f":"MATCH(V$4,Millwall!$Z76:$AK76,0)","v":{"$error":"#N/A"}},{"$f":"MATCH(W$4,Millwall!$Z76:$AK76,0)","v":{"$error":"#N/A"}},{"$f":"MATCH(X$4,Millwall!$Z76:$AK76,0)","v":11},{"$f":"MATCH(Y$4,Millwall!$Z76:$AK76,0)","v":{"$error":"#N/A"}},{"$f":"MATCH(Z$4,Millwall!$Z76:$AK76,0)","v":{"$error":"#N/A"}},{"$f":"MATCH(AA$4,Millwall!$Z76:$AK76,0)","v":10},{"$f":"MATCH(AB$4,Millwall!$Z76:$AK76,0)","v":1},{"$f":"MATCH(AC$4,Millwall!$Z76:$AK76,0)","v":5},{"$f":"MATCH(AD$4,Millwall!$Z76:$AK76,0)","v":{"$error":"#N/A"}},{"$f":"MATCH(AE$4,Millwall!$Z76:$AK76,0)","v":6},{"$f":"MATCH(AF$4,Millwall!$Z76:$AK76,0)","v":7},{"$f":"MATCH(AG$4,Millwall!$Z76:$AK76,0)","v":{"$error":"#N/A"}},{"$f":"MATCH(AH$3,Millwall!$Z76:$AK76,0)","v":{"$error":"#N/A"}},{"$f":"MATCH(AI$3,Millwall!$Z76:$AK76,0)","v":8},{"$f":"MATCH(AJ$3,Millwall!$Z76:$AK76,0)","v":{"$error":"#N/A"}},{"$f":"MATCH(AK$3,Millwall!$Z76:$AK76,0)","v":{"$error":"#N/A"}},{"$f":"MATCH(AL$3,Millwall!$Z76:$AK76,0)","v":{"$error":"#N/A"}},{"$f":"MATCH(AM$3,Millwall!$Z76:$AK76,0)","v":{"$error":"#N/A"}},{"$f":"MATCH(AN$3,Millwall!$Z76:$AK76,0)","v":{"$error":"#N/A"}},{"$f":"MATCH(AO$3,Millwall!$Z76:$AK76,0)","v":{"$error":"#N/A"}},{"$f":"MATCH(AP$3,Millwall!$Z76:$AK76,0)","v":{"$error":"#N/A"}},{"$f":"MATCH(AQ$3,Millwall!$Z76:$AK76,0)","v":{"$error":"#N/A"}},{"$f":"MATCH(AR$3,Millwall!$Z76:$AK76,0)","v":{"$error":"#N/A"}},null,null,null,null,null,{"$f":"MATCH(AX$3,Millwall!$Z76:AK76,0)","v":{"$error":"#N/A"}},{"$f":"MATCH(AY$3,Millwall!$Z76:AK76,0)","v":{"$error":"#N/A"}},{"$f":"MATCH(AZ$3,Millwall!$Z76:AK76,0)","v":{"$error":"#N/A"}},{"$f":"MATCH(BA$3,Millwall!$Z76:AK76,0)","v":{"$error":"#N/A"}},{"$f":"MATCH(BB$3,Millwall!$Z76:AK76,0)","v":12},{"$f":"MATCH(BC$3,Millwall!$Z76:AK76,0)","v":{"$error":"#N/A"}},{"$f":"MATCH(BD$3,Millwall!$Z76:AK76,0)","v":{"$error":"#N/A"}},{"$f":"MATCH(BE$3,Millwall!$Z76:AK76,0)","v":{"$error":"#N/A"}},{"$f":"MATCH(BF$3,Millwall!$Z76:AK76,0)","v":{"$error":"#N/A"}},{"$f":"MATCH(BG$3,Millwall!$Z76:AK76,0)","v":{"$error":"#N/A"}},{"$f":"MATCH(BH$3,Millwall!$Z76:AK76,0)","v":{"$error":"#N/A"}},{"$f":"MATCH(BI$3,Millwall!$Z76:AK76,0)","v":{"$error":"#N/A"}},{"$f":"MATCH(BJ$3,Millwall!$Z76:AK76,0)","v":{"$error":"#N/A"}},{"$f":"MATCH(BK$3,Millwall!$Z76:AK76,0)","v":{"$error":"#N/A"}},{"$f":"MATCH(BL$3,Millwall!$Z76:AK76,0)","v":{"$error":"#N/A"}},{"$f":"MATCH(BM$3,Millwall!$Z76:AK76,0)","v":{"$error":"#N/A"}},{"$f":"MATCH(BN$3,Millwall!$Z76:AK76,0)","v":10},{"$f":"MATCH(BO$3,Millwall!$Z76:AK76,0)","v":{"$error":"#N/A"}},{"$f":"MATCH(BP$3,Millwall!$Z76:AK76,0)","v":{"$error":"#N/A"}},{"$f":"MATCH(BQ$3,Millwall!$Z76:AK76,0)","v":{"$error":"#N/A"}},{"$f":"MATCH(BR$3,Millwall!$Z76:AK76,0)","v":{"$error":"#N/A"}},{"$f":"MATCH(BS$3,Millwall!$Z76:AK76,0)","v":{"$error":"#N/A"}},{"$f":"MATCH(BT$3,Millwall!$Z76:AK76,0)","v":{"$error":"#N/A"}},{"$f":"MATCH(BU$3,Millwall!$Z76:AK76,0)","v":{"$error":"#N/A"}},{"$f":"MATCH(BV$3,Millwall!$Z76:AK76,0)","v":{"$error":"#N/A"}},{"$f":"MATCH(BW$3,Millwall!$Z76:AK76,0)","v":{"$error":"#N/A"}},{"$f":"MATCH(BX$3,Millwall!$Z76:AK76,0)","v":{"$error":"#N/A"}},{"$f":"MATCH(BY$3,Millwall!$Z76:AK76,0)","v":{"$error":"#N/A"}},{"$f":"MATCH(BZ$3,Millwall!$Z76:AK76,0)","v":{"$error":"#N/A"}},{"$f":"MATCH(CA$3,Millwall!$Z76:AK76,0)","v":{"$error":"#N/A"}},{"$f":"MATCH(CB$3,Millwall!$Z76:AK76,0)","v":{"$error":"#N/A"}},{"$f":"MATCH(CC$3,Millwall!$Z76:AK76,0)","v":{"$error":"#N/A"}},{"$f":"MATCH(CD$3,Millwall!$Z76:AK76,0)","v":{"$error":"#N/A"}},{"$f":"MATCH(CE$3,Millwall!$Z76:AK76,0)","v":{"$error":"#N/A"}},null,null,null,null,null,null,null,{"$f":"Millwall!$BN54","v":"Baldwin"},{"$f":"Millwall!$BN54&\" (**\"","v":"Baldwin (**"},{"$f":"Millwall!$BN54&\"**\"","v":"Baldwin**"},null,{"$f":"$CM$6","v":"Baldwin"},{"$f":"$CN$6","v":"Baldwin (**"},{"$f":"$CO$6","v":"Baldwin**"},null,{"$f":"Millwall!$BV$7","v":1}]
{"$rows_left_out":260}
{"sheet":"Sheet1","index":2,"n_rows":195,"n_cols":63,"rows_kept":195,"cut":false,"hidden":false,"merged":[[5,1,7,1],[5,52,7,52],[15,1,17,1],[15,52,17,52],[25,1,27,1],[25,52,27,52],[35,1,37,1],[35,52,37,52],[45,1,47,1],[45,52,47,52],[55,1,57,1],[55,52,57,52],[65,1,67,1],[65,52,67,52],[75,1,77,1],[75,52,77,52],[85,1,87,1],[85,52,87,52],[95,1,97,1],[95,52,97,52],[105,1,107,1],[105,52,107,52],[115,1,117,1],[115,52,117,52],[155,1,157,1],[155,52,157,52],[200,13,200,14],[201,13,201,14],[125,1,127,1],[125,52,127,52],[135,1,137,1],[135,52,137,52],[145,1,147,1],[145,52,147,52]]}
[]
[null,null,null,null,null,null,null,null,null,null,null,null,null,null,null,null,null,null,null,null,null,null,null,null,null,null,null,null,null,null,null,null,null,null,null,null,null,null,null,null,null,null,null,null,null,null,null,null,null,null,null,null,null,null,null,null,null,null,null,null,null,null,{"$f":"158-70","v":88}]
[]
[]
[]
[null,75,null,null,null,null,null,null,null,null,null,null,null,null,null,null,null,null,null,null,null,null,null,null,null,null,null,null,null,null,null,null,null,null,null,null,null,null,null,null,null,null,null,null,null,null,null,null,null,null,null,null,75]
{"$rows_left_out":190}
{"sheet":"Sheet2","index":3,"n_rows":47,"n_cols":26,"rows_kept":47,"cut":false,"hidden":false,"merged":[]}
[null,null,"Millwall 1974/75 results and fixtures ",null,null,null,{"$f":"[4]Summary!$AP$65","v":32},{"$f":"[4]Summary!$Q$22","v":20},{"$f":"[4]Summary!$AP$10","v":61},1,{"$f":"[4]Summary!$AP$13","v":51},4,{"$f":"[4]Summary!$AP$28","v":35},19,{"$f":"[4]Summary!$AP$31","v":21},22,null,null,{"$f":"[4]Summary!$T$5","v":84},{"$f":"[4]Summary!$AP$12","v":53},3,{"$f":"[4]Summary!$AP$29","v":32},20,null,null,{"$f":"[4]Summary!$U$7","v":"Bristol R D 1-1"}]
[]
[]
[null,null,null,null,null,null,"x"]
[null,"Game","Competition",null,"Pts","Pos","Millwall","Pos","top","Pos","4th","Pos","19th","Pos","Bottom","Pos","Bottom","Pos","Day","3rd","Pos","21st","Pos",null,null,"Vesus"]
[null,1,"Division 2","Sunderland (H) L 1-4",null,null,0,19,2,1,2,4,0,19,0,22,null,null,1,2,3,0,20,null,null,"Sunderland L 1-4"]
{"$rows_left_out":42}
{"sheet":"Sheet3","index":4,"n_rows":144,"n_cols":57,"rows_kept":144,"cut":false,"hidden":false,"merged":[[23,50,25,50],[7,1,9,1],[8,50,10,50],[13,50,15,50],[17,1,19,1],[18,50,20,50],[63,50,65,50],[27,1,29,1],[28,50,30,50],[33,50,35,50],[37,1,39,1],[38,50,40,50],[43,50,45,50],[47,1,49,1],[48,50,50,50],[53,50,55,50],[57,1,59,1],[58,50,60,50],[103,50,105,50],[67,1,69,1],[68,50,70,50],[73,50,75,50],[77,1,79,1],[78,50,80,50],[83,50,85,50],[87,1,89,1],[88,50,90,50],[93,50,95,50],[97,1,99,1],[98,50,100,50],[127,1,129,1],[107,1,109,1],[108,50,110,50],[113,50,115,50],[117,1,119,1],[118,50,120,50],[123,50,125,50]]}
[]
[null,null,null,null,null,null,null,null,null,null,null,null,null,null,null,null,null,null,null,null,null,null,null,null,null,null,null,null,null,null,null,null,null,null,null,null,null,null,null,null,null,null,null,null,null,null,null,null,null,null,null,null,null,null,null,5,46]
[]
[]
[]
[null,null,"Points",null,null,null,null,null,null,null,null,null,null,null,null,null,null,null,null,null,null,null,null,null,null,null,null,null,null,null,null,null,null,null,null,null,null,null,null,null,null,null,null,null,null,null,null,null,null,"Position"]
{"$rows_left_out":138}