{"text_format":"1","workbook":"xlsx","n_sheets":5,"sheets":["Millwall","Comparisons","Sheet1","Sheet2","Sheet3"],"not_rendered":{"charts":1,"images":3,"macros":1,"external_links":4,"defined_names":13,"comments":0,"pivot_tables":0},"unopened":[],"bounds":{"document_bytes":16777216,"sheet_cells":100000,"rows_first":2000,"rows_last":500,"rows_between":2000,"halvings":0,"cell_chars":16384,"cell_head_chars":4096},"cells_cut":0,"cells_raw":0,"read":"whole","date_system":"1900"}

{"sheet":"Millwall","index":0,"n_rows":136,"n_cols":141,"rows_kept":136,"cut":false,"hidden":false,"merged":[[50,70,50,71],[50,73,50,74],[50,67,50,68],[4,64,4,65],[2,82,2,85],[3,66,3,68],[3,70,3,72],[3,74,3,76],[3,78,3,80],[3,82,3,84],[2,66,2,69],[2,70,2,73],[2,74,2,77],[2,78,2,81]]}
[null,null,1]
[]
[null,null,null,null,null,null,null,null,null,null,null,null,null,null,null,null,null,null,null,null,null,null,null,null,null,null,null,null,null,null,null,null,null,null,null,null,null,null,null,null,null,null,null,null,null,null,null,null,null,null,null,null,null,null,null,null,"Check with Complete History 2010",null,null,null,null,null,null,null,null,null,"All",null,null,null,"Division Two",null,null,null,"FA Cup",null,null,null,"League Cup",null,null,null,"LDV Trophy"]
[null,null,"Game","Competition","Date",null,"Us & Them","Opponents",null,"Score","HT","Att","Pts","Pos","Goal Scorers",null,null,null,null,"Game","Competition","Date","Opponents",null,"Score",1,2,3,4,5,6,7,8,9,10,11,null,null,12,null,null,null,null,null,null,null,null,null,null,null,null,null,null,null,null,null,null,null,null,null,null,null,null,null,null,null,{"$f":"\"Max (\"&BM100&\")\"","v":"Max (46)"},null,null,null,{"$f":"\"Max (\"&BM97&\")\"","v":"Max (42)"},null,null,null,{"$f":"\"Max (\"&BM99&\")\"","v":"Max (3)"},null,null,null,{"$f":"\"Max (\"&BM98&\")\"","v":"Max (1)"},null,null,null,"Max (2)",null,null,null,null,null,null,null,null,null,null,null,null,null,null,null,null,null,null,null,null,null,null,null,null,null,null,null,null,null,null,null,null,null,null,null,null,null,null,null,null,null,null,null,null,null,null,null,null,null,null,null,null,null,null,null,"Opposition","Pts","Pos"]
[1,null,1,"Division 2","1974-08-17",null,"-","Sunderland","(H)","L 1-4","1-2",10572,0,19,"Saul / Kerr , Towers, Halom , Hughes",1,1,null,null,1,"Division 2","1974-08-17","Sunderland","(H)","L 1-4","King","B Brown","Cripps","Donaldson","Dorney","Allder","Saul","Smethurst","Wood","Clark","Hill",null,null,"-",null,null,null,null,null,null,null,null,null,null,null,null,null,null,null,null,null,"Apps","Sub","Apps","Sub","Apps","Sub",null,null,"Player  ",null,"Apps","Sub","NPS","Goals","Apps","Sub","NPS","Goals","Apps","Sub","NPS","Goals","Apps","Sub","NPS","Goals","Apps","Sub","Nps","Goals",null,null,null,null,null,null,null,null,null,null,null,null,null,null,null,null,null,null,null,null,null,null,null,null,null,null,null,null,null,null,null,null,null,null,null,null,null,null,null,null,null,null,null,null,null,null,null,null,null,null,null,null,"Sunderland (H) L 1-4",0,19]
[{"$f":"IF(A5=0,1,IF(A5=2,1,2))","v":2},null,2,"Division 2","1974-08-19",null,"22nd v 15th","Nottm Forest","(H)","W 3-0","1-0",7509,2,7,"Hill (2) , M Kelly",2,{"$f":"IF(Q5=0,1,IF(Q5=2,1,2))","v":2},null,null,2,"Division 2","1974-08-19","Nottm Forest","(H)","W 3-0","King","Donaldson","B Brown","Dorney","Kitchener","Saul","Smethurst","Wood","Clark","M Kelly","Hill",null,null,"S Brown",null,null,null,null,null,null,null,null,null,null,null,null,null,null,null,null,{"$f":"IF(BE6=BS6,IF(BF6=BT6,IF(BG6=BW6,IF(BH6=BX6,IF(BI6=CA6,IF(BJ6=CB6,\"OK\",\"Error\"),\"Error\"),\"Error\"),\"Error\"),\"Error\"),\"Error\")","v":"OK"},26,5,2,1,0,0,1,null,"Doug Allder",null,{"$f":"BS6+BW6+CA6+CE6","v":28},{"$f":"BT6+BX6+CB6+CF6","v":6},0,{"$f":"BV6+BZ6+CD6+CH6","v":1},{"$f":"$BP$53","v":26},{"$f":"$BR$53","v":5},0,1,{"$f":"$BS$53","v":2},{"$f":"$BT$53","v":1},0,0,{"$f":"$BV$53","v":0},{"$f":"$BW$53","v":0},0,0,null,null,null,null,null,6,null,null,null,null,null,null,null,null,null,null,null,null,null,null,null,null,null,null,null,null,null,null,null,null,null,null,null,null,null,null,null,null,null,null,null,null,null,null,null,null,null,null,null,null,null,null,null,null,null,null,"Nottm Forest (H) W 3-0",2,7]
[{"$f":"IF(A6=0,1,IF(A6=2,1,2))","v":1},null,3,"Division 2","1974-08-24",null,"6th v 5th","Man Utd","(A)","L 0-4","0-2",41897,2,13,"Daly (3 (2 pens) ) , Pearson",3,{"$f":"IF(Q6=0,1,IF(Q6=2,1,2))","v":1},null,null,3,"Division 2","1974-08-24","Man Utd","(A)","L 0-4","King","Donaldson","B Brown","Dorney","Kitchener","Saul","Smethurst","Wood","Clark","M Kelly","Hill",null,null,"Bolland",null,null,null,null,null,null,null,null,null,null,null,null,null,null,null,null,{"$f":"IF(BE7=BS7,IF(BF7=BT7,IF(BG7=BW7,IF(BH7=BX7,IF(BI7=CA7,IF(BJ7=CB7,\"OK\",\"Error\"),\"Error\"),\"Error\"),\"Error\"),\"Error\"),\"Error\")","v":"OK"},6,0,0,0,0,0,{"$f":"IF(BK6=0,1,IF(BK6=2,1,2))","v":2},null,"Tommy Baldwin",null,6,0,0,1,{"$f":"$BP$54","v":6},{"$f":"$BR$54","v":0},0,1,{"$f":"$BS$54","v":0},{"$f":"$BT$54","v":0},0,0,{"$f":"$BV$54","v":0},{"$f":"$BW$54","v":0},0,0,null,null,null,null,null,18,null,null,null,null,null,null,null,null,null,null,null,null,null,null,null,null,null,null,null,null,null,null,null,null,null,null,null,null,null,null,null,null,null,null,null,null,null,null,null,null,null,null,null,null,null,null,null,null,null,null,"Man Utd (A) L 0-4",2,13]
[2,null,4,"Division 2","1974-08-27",null,"16th v 21st","Nottm Forest","(A)","L 1-2","1-1",7957,2,18,"Smethurst / Martin , Bowyer",4,2,null,null,4,"Division 2","1974-08-27","Nottm Forest","(A)","L 1-2","King","Donaldson","B Brown","Dorney","Kitchener","Saul","Smethurst","Wood","Bolland","M Kelly","Hill",null,null,"-",null,null,null,null,null,null,null,null,null,null,null,null,null,null,null,null,{"$f":"IF(BE8=BS8,IF(BF8=BT8,IF(BG8=BW8,IF(BH8=BX8,IF(BI8=CA8,IF(BJ8=CB8,\"OK\",\"Error\"),\"Error\"),\"Error\"),\"Error\"),\"Error\"),\"Error\")","v":"OK"},28,1,2,1,1,0,{"$f":"IF(BK7=0,1,IF(BK7=2,1,2))","v":1},null,"Gordon Bolland",null,31,2,0,6,{"$f":"$BP$55","v":28},{"$f":"$BR$55","v":1},0,5,{"$f":"$BS$55","v":2},{"$f":"$BT$55","v":1},0,1,{"$f":"$BV$55","v":1},{"$f":"$BW$55","v":0},0,0,null,null,null,null,null,15,null,null,null,null,null,null,null,null,null,null,null,null,null,null,null,null,null,null,null,null,null,null,null,null,null,null,null,null,null,null,null,null,null,null,null,null,null,null,null,null,null,null,null,null,null,null,null,null,null,null,"Nottm Forest (A) L 1-2",2,18]
[1,null,5,"Division 2","1974-08-31",null,"19th v 1st","Fulham","(H)","W 2-0","1-0",9936,4,12,"Bolland (2)",5,1,null,null,5,"Division 2","1974-08-31","Fulham","(H)","W 2-0","King","Donaldson","Jones","Dorney","Kitchener","Saul","Smethurst","M Kelly","Wood","Bolland","Hill",null,null,"-",null,null,null,null,null,null,null,null,null,null,null,null,null,null,null,null,"OK",9,0,0,0,0,0,2,null,"Bryan Brown",null,9,0,0,0,{"$f":"$BP$56","v":9},{"$f":"$BR$56","v":0},0,0,{"$f":"$BS$56","v":0},{"$f":"$BT$56","v":0},0,0,{"$f":"$BV$56","v":0},{"$f":"$BW$56","v":0},0,0,null,null,null,null,null,2,null,null,null,null,null,null,null,null,null,null,null,null,null,null,null,null,null,null,null,null,null,null,null,null,null,null,null,null,null,null,null,null,null,null,null,null,null,null,null,null,null,null,null,null,null,null,null,null,null,null,"Fulham (H) W 2-0",4,12]
[2,null,6,"League Cup","1974-09-02",null,"-","West Brom","(A)","L 0-1","0-1",8294,"-","-","Cantello",null,2,null,null,6,"League Cup","1974-09-02","West Brom","(A)","L 0-1","King","Donaldson","Jones","Dorney","Kitchener","Saul","Smethurst","M Kelly","Clark","Bolland","Hill",null,null,"-",null,null,null,null,null,null,null,null,null,null,null,null,null,null,null,null,"OK",1,4,0,0,0,0,1,null,"Steve Brown",null,1,4,0,1,{"$f":"$BP$57","v":1},{"$f":"$BR$57","v":4},0,1,{"$f":"$BS$57","v":0},{"$f":"$BT$57","v":0},0,0,{"$f":"$BV$57","v":0},{"$f":"$BW$57","v":0},0,0,null,null,null,null,null,14,null,null,null,null,null,null,null,null,null,null,null,null,null,null,null,null,null,null,null,null,null,null,null,null,null,null,null,null,null,null,null,null,null,null,null,null,null,null,null,null,null,null,null,null,null,null,null,null,null,null,"Blackpool (A) L 0-1",4,15]
[1,null,7,"Division 2","1974-09-07",null,"14th v 6th","Blackpool","(A)","L 0-1","0-0",5579,4,15,"Walsh",6,1,null,null,7,"Division 2","1974-09-07","Blackpool","(A)","L 0-1","King","Donaldson","Jones","Dorney","Kitchener","Saul","Smethurst","Bolland","Wood","M Kelly","Hill",null,null,"Allder",null,null,null,null,null,null,null,null,null,null,null,null,null,null,null,null,"OK",6,0,0,0,0,0,2,null,"Dennis Burnett",null,6,0,0,2,{"$f":"$BP$58","v":6},{"$f":"$BR$58","v":0},0,2,{"$f":"$BS$58","v":0},{"$f":"$BT$58","v":0},0,0,{"$f":"$BV$58","v":0},{"$f":"$BW$58","v":0},0,0,null,null,null,null,null,25,null,null,null,null,null,null,null,null,null,null,null,null,null,null,null,null,null,null,null,null,null,null,null,null,null,null,null,null,null,null,null,null,null,null,null,null,null,null,null,null,null,null,null,null,null,null,null,null,null,null,"Oxford (H) D 0-0",5,16]
[2,null,8,"Division 2","1974-09-14",null,"16th v 5th","Oxford","(H)","D 0-0","0-0",5908,5,16,null,7,2,null,null,8,"Division 2","1974-09-14","Oxford","(H)","D 0-0","King","Donaldson","Jones","Dorney","Kitchener","Saul","Smethurst","Bolland","Wood","M Kelly","Hill",null,null,"Clark",null,null,null,null,null,null,null,null,null,null,null,null,null,null,null,null,"OK",25,5,3,0,1,0,1,null,"Brian Clark",null,29,5,0,6,{"$f":"$BP$59","v":25},{"$f":"$BR$59","v":5},0,6,{"$f":"$BS$59","v":3},{"$f":"$BT$59","v":0},0,0,{"$f":"$BV$59","v":1},{"$f":"$BW$59","v":0},0,0,null,null,null,null,null,10,null,null,null,null,null,null,null,null,null,null,null,null,null,null,null,null,null,null,null,null,null,null,null,null,null,null,null,null,null,null,null,null,null,null,null,null,null,null,null,null,null,null,null,null,null,null,null,null,null,null,"Man Utd (H) L 0-1",5,18]
[1,null,9,"Division 2","1974-09-16",null,"16th v 1st","Man Utd","(H)","L 0-1","0-0",16988,5,18,"Daly (pen)",8,1,null,null,9,"Division 2","1974-09-16","Man Utd","(H)","L 0-1","King","Donaldson","Jones","Dorney","Kitchener","Saul","Bolland","Clark","Wood","Allder","Hill",null,null,"-",null,null,null,null,null,null,null,null,null,null,null,null,null,null,null,null,"OK",1,0,0,0,0,0,2,null,"Harry Cripps",null,1,0,0,0,{"$f":"$BP$60","v":1},{"$f":"$BR$60","v":0},0,0,{"$f":"$BS$60","v":0},{"$f":"$BT$60","v":0},0,0,{"$f":"$BV$60","v":0},{"$f":"$BW$60","v":0},0,0,null,null,null,null,null,3,null,null,null,null,null,null,null,null,null,null,null,null,null,null,null,null,null,null,null,null,null,null,null,null,null,null,null,null,null,null,null,null,null,null,null,null,null,null,null,null,null,null,null,null,null,null,null,null,null,null,"Aston Villa (A) L 0-3",5,21]
[2,null,10,"Division 2","1974-09-21",null,"20th v 6th","Aston Villa","(A)","L 0-3","0-1",21375,5,21,"Graydon (3 (1 Pen) )",9,2,null,null,10,"Division 2","1974-09-21","Aston Villa","(A)","L 0-3","King","Donaldson","Jones","Dorney","Kitchener","Allder","Saul","Smethurst","Wood","Bolland","Hill",null,null,"Clark",null,null,null,null,null,null,null,null,null,null,null,null,null,null,null,null,"OK",4,0,0,0,0,0,1,null,"Michael Dillon",null,4,0,0,0,{"$f":"$BP$61","v":4},{"$f":"$BR$61","v":0},0,0,{"$f":"$BS$61","v":0},{"$f":"$BT$61","v":0},0,0,{"$f":"$BV$61","v":0},{"$f":"$BW$61","v":0},0,0,null,null,null,null,null,19,null,null,null,null,null,null,null,null,null,null,null,null,null,null,null,null,null,null,null,null,null,null,null,null,null,null,null,null,null,null,null,null,null,null,null,null,null,null,null,null,null,null,null,null,null,null,null,null,null,null,"Hull City (A) D 1-1",6,18]
[1,null,11,"Division 2","1974-09-24",null,"21st v 16th","Hull City","(A)","D 1-1","0-0",5997,6,18,"Hill / Wagstaff",10,1,null,null,11,"Division 2","1974-09-24","Hull City","(A)","D 1-1","King","B Brown","Jones","Donaldson","Kitchener","Dorney","Bolland","Saul","Smethurst","Allder","Hill",null,null,"-",null,null,null,null,null,null,null,null,null,null,null,null,null,null,null,null,"OK",29,0,2,0,1,0,2,null,"Dave Donaldson",null,32,0,0,1,{"$f":"$BP$62","v":29},{"$f":"$BR$62","v":0},0,1,{"$f":"$BS$62","v":2},{"$f":"$BT$62","v":0},0,0,{"$f":"$BV$62","v":1},{"$f":"$BW$62","v":0},0,0,null,null,null,null,null,4,null,null,null,null,null,null,null,null,null,null,null,null,null,null,null,null,null,null,null,null,null,null,null,null,null,null,null,null,null,null,null,null,null,null,null,null,null,null,null,null,null,null,null,null,null,null,null,null,null,null,"Bristol C (H) W 1-0",8,18]
[2,null,12,"Division 2","1974-09-28",null,"20th v 7th","Bristol C","(H)","W 1-0","0-0",5750,8,18,"Dorney",11,2,null,null,12,"Division 2","1974-09-28","Bristol C","(H)","W 1-0","King","B Brown","Jones","Donaldson","Kitchener","Dorney","Saul","Smethurst","Bolland","Allder","Hill",null,null,"Wood",null,null,null,null,null,null,null,null,null,null,null,null,null,null,null,null,"OK",36,0,3,0,1,0,1,null,"Alan Dorney",null,40,0,0,1,{"$f":"$BP$63","v":36},{"$f":"$BR$63","v":0},0,1,{"$f":"$BS$63","v":3},{"$f":"$BT$63","v":0},0,0,{"$f":"$BV$63","v":1},{"$f":"$BW$63","v":0},0,0,null,null,null,null,null,5,null,null,null,null,null,null,null,null,null,null,null,null,null,null,null,null,null,null,null,null,null,null,null,null,null,null,null,null,null,null,null,null,null,null,null,null,null,null,null,null,null,null,null,null,null,null,null,null,null,null,"Norwich (A) L 0-2",8,20]
[1,null,13,"Division 2","1974-10-05",null,"18th v 3rd","Norwich","(A)","L 0-2","0-1",19216,8,20,"Powell , MacDougall (pen)",12,1,null,null,13,"Division 2","1974-10-05","Norwich","(A)","L 0-2","King","B Brown","Jones","Donaldson","Kitchener","Dorney","Saul","Bolland","Wood","Allder","Hill",null,null,"-",null,null,null,null,null,null,null,null,null,null,null,null,null,null,null,null,"OK",13,0,0,0,0,0,2,null,"Ray Evans",null,13,0,0,1,{"$f":"$BP$64","v":13},{"$f":"$BR$64","v":0},0,1,{"$f":"$BS$64","v":0},{"$f":"$BT$64","v":0},0,0,{"$f":"$BV$64","v":0},{"$f":"$BW$64","v":0},0,0,null,null,null,null,null,23,null,null,null,null,null,null,null,null,null,null,null,null,null,null,null,null,null,null,null,null,null,null,null,null,null,null,null,null,null,null,null,null,null,null,null,null,null,null,null,null,null,null,null,null,null,null,null,null,null,null,"Southampton (H) W 4-0",10,16]
[2,null,14,"Division 2","1974-10-12",null,"21st v 18th","Southampton","(H)","W 4-0","2-0",9306,10,16,"Clark (2) , Bolland (2 (2 pens)",13,2,null,null,14,"Division 2","1974-10-12","Southampton","(H)","W 4-0","King","B Brown","Jones","Donaldson","Kitchener","Dorney","Saul","Clark","Wood","Bolland","Allder",null,null,"-",null,null,null,null,null,null,null,null,null,null,null,null,null,null,null,null,"OK",21,0,3,0,0,0,1,null,"Tony Hazell",null,24,0,0,2,{"$f":"$BP$65","v":21},{"$f":"$BR$65","v":0},0,2,{"$f":"$BS$65","v":3},{"$f":"$BT$65","v":0},0,0,{"$f":"$BV$65","v":0},{"$f":"$BW$65","v":0},0,0,null,null,null,null,null,21,null,null,null,null,null,null,null,null,null,null,null,null,null,null,null,null,null,null,null,null,null,null,null,null,null,null,null,null,null,null,null,null,null,null,null,null,null,null,null,null,null,null,null,null,null,null,null,null,null,null,"Bristol R (A) L 0-2",10,19]
[1,null,15,"Division 2","1974-10-19",null,"16th v 17th","Bristol R","(A)","L 0-2","0-1",9173,10,19,"Bannister (pen) , Stanton",14,1,null,null,15,"Division 2","1974-10-19","Bristol R","(A)","L 0-2","King","B Brown","Jones","Donaldson","Kitchener","Dorney","Bolland","Saul","Wood","Clark","Allder",null,null,"Hill",null,null,null,null,null,null,null,null,null,null,null,null,null,null,null,null,"OK",26,5,2,1,1,0,2,null,"Gordon Hill",null,29,6,0,6,{"$f":"$BP$66","v":26},{"$f":"$BR$66","v":5},0,5,{"$f":"$BS$66","v":2},{"$f":"$BT$66","v":1},0,1,{"$f":"$BV$66","v":1},{"$f":"$BW$66","v":0},0,0,null,null,null,null,null,11,null,null,null,null,null,null,null,null,null,null,null,null,null,null,null,null,null,null,null,null,null,null,null,null,null,null,null,null,null,null,null,null,null,null,null,null,null,null,null,null,null,null,null,null,null,null,null,null,null,null,"West Brom (H) D 2-2",11,18]
[2,null,16,"Division 2","1974-10-26",null,"19th v 6th","West Brom","(H)","D 2-2","2-2",8179,11,18,"Wood , Clark / Hughes , Kitchener (og)",15,2,null,null,16,"Division 2","1974-10-26","West Brom","(H)","D 2-2","King","Donaldson","Jones","Dorney","Kitchener","Allder","Saul","Clark","Wood","Bolland","Hill",null,null,"S Brown",null,null,null,null,null,null,null,null,null,null,null,null,null,null,null,null,{"$f":"IF(BE20=BS21,IF(BF20=BT21,IF(BG20=BW21,IF(BH20=BX21,IF(BI20=CA21,IF(BJ20=CB21,\"OK\",\"Error\"),\"Error\"),\"Error\"),\"Error\"),\"Error\"),\"Error\")","v":"Error"},19,1,1,0,1,0,1,null,"Eddie Jones",null,{"$f":"BS20+BW20+CA20+CE20","v":21},1,0,0,{"$f":"$BP$67","v":19},{"$f":"$BR$67","v":1},0,0,{"$f":"$BS$67","v":1},{"$f":"$BT$67","v":0},0,0,{"$f":"$BV$67","v":1},{"$f":"$BW$67","v":0},0,0,null,null,null,null,null,16,null,null,null,null,null,null,null,null,null,null,null,null,null,null,null,null,null,null,null,null,null,null,null,null,null,null,null,null,null,null,null,null,null,null,null,null,null,null,null,null,null,null,null,null,null,null,null,null,null,null,"Oldham (A) D 1-1",12,19]
[1,null,17,"Division 2","1974-11-02",null,"18th v 17th","Oldham","(A)","D 1-1","0-1",10311,12,19,"Wood / Blair",16,1,null,null,17,"Division 2","1974-11-02","Oldham","(A)","D 1-1","King","Donaldson","Jones","Dorney","Kitchener","Saul","Allder","Clark","Wood","Bolland","Hill",null,null,"S Brown",null,null,null,null,null,null,null,null,null,null,null,null,null,null,null,null,{"$f":"IF(BE21=BS20,IF(BF21=BT20,IF(BG21=BW20,IF(BH21=BX20,IF(BI21=CA20,IF(BJ21=CB20,\"OK\",\"Error\"),\"Error\"),\"Error\"),\"Error\"),\"Error\"),\"Error\")","v":"Error"},9,2,0,0,0,0,2,null,"Chris Kelly",null,9,2,0,0,{"$f":"$BP$68","v":9},{"$f":"$BR$68","v":2},0,0,{"$f":"$BS$68","v":0},{"$f":"$BT$68","v":0},0,0,{"$f":"$BV$68","v":0},{"$f":"$BW$68","v":0},0,0,null,null,null,null,null,24,null,null,null,null,null,null,null,null,null,null,null,null,null,null,null,null,null,null,null,null,null,null,null,null,null,null,null,null,null,null,null,null,null,null,null,null,null,null,null,null,null,null,null,null,null,null,null,null,null,null,"Bolton (H) D 1-1",13,19]
[2,null,18,"Division 2","1974-11-09",null,"19th v 10th","Bolton","(H)","D 1-1","1-0",7136,13,19,"Hill / Curran",17,2,null,null,18,"Division 2","1974-11-09","Bolton","(H)","D 1-1","King","Donaldson","Jones","Dorney","Kitchener","Allder","Saul","Clark","Wood","Bolland","Hill",null,null,"S Brown",null,null,null,null,null,null,null,null,null,null,null,null,null,null,null,null,{"$f":"IF(BE22=BS22,IF(BF22=BT22,IF(BG22=BW22,IF(BH22=BX22,IF(BI22=CA22,IF(BJ22=CB22,\"OK\",\"Error\"),\"Error\"),\"Error\"),\"Error\"),\"Error\"),\"Error\")","v":"OK"},6,0,0,0,1,0,1,null,"Michael Kelly",null,7,0,0,1,{"$f":"$BP$69","v":6},{"$f":"$BR$69","v":0},0,1,{"$f":"$BS$69","v":0},{"$f":"$BT$69","v":0},0,0,{"$f":"$BV$69","v":1},{"$f":"$BW$69","v":0},0,0,null,null,null,null,null,13,null,null,null,null,null,null,null,null,null,null,null,null,null,null,null,null,null,null,null,null,null,null,null,null,null,null,null,null,null,null,null,null,null,null,null,null,null,null,null,null,null,null,null,null,null,null,null,null,null,null,"York (A) L 1-2",13,19]
[1,null,19,"Division 2","1974-11-16",null,"19th v 15th","York","(A)","L 1-2","0-1",6102,13,19,"Brown / Jones , Seal ",18,1,null,null,19,"Division 2","1974-11-16","York","(A)","L 1-2","King","Donaldson","Jones","Dorney","Kitchener","Allder","Saul","Clark","S Brown","Bolland","Hill",null,null,"-",null,null,null,null,null,null,null,null,null,null,null,null,null,null,null,null,{"$f":"IF(BE23=BS23,IF(BF23=BT23,IF(BG23=BW23,IF(BH23=BX23,IF(BI23=CA23,IF(BJ23=CB23,\"OK\",\"Error\"),\"Error\"),\"Error\"),\"Error\"),\"Error\"),\"Error\")","v":"OK"},42,0,3,0,1,0,2,null,"Bryan King",null,46,0,0,0,{"$f":"$BP$70","v":42},{"$f":"$BR$70","v":0},0,0,{"$f":"$BS$70","v":3},{"$f":"$BT$70","v":0},0,0,{"$f":"$BV$70","v":1},{"$f":"$BW$70","v":0},0,0,null,null,null,null,null,1,null,null,null,null,null,null,null,null,null,null,null,null,null,null,null,null,null,null,null,null,null,null,null,null,null,null,null,null,null,null,null,null,null,null,null,null,null,null,null,null,null,null,null,null,null,null,null,null,null,null,"Notts Co (A) L 1-2",13,20]
[2,null,20,"Division 2","1974-11-30",null,"21st v 12th","Notts Co","(A)","L 1-2","1-2",9248,13,20,"Richards (og) / Bolton , Randell",19,2,null,null,20,"Division 2","1974-11-30","Notts Co","(A)","L 1-2","King","Donaldson","Jones","Dorney","Kitchener","Allder","Saul","Summerill","Baldwin","Bolland","Hill",null,null,"Clark",null,null,null,null,null,null,null,null,null,null,null,null,null,null,null,null,{"$f":"IF(BE24=BS24,IF(BF24=BT24,IF(BG24=BW24,IF(BH24=BX24,IF(BI24=CA24,IF(BJ24=CB24,\"OK\",\"Error\"),\"Error\"),\"Error\"),\"Error\"),\"Error\"),\"Error\")","v":"OK"},39,0,3,0,1,0,{"$f":"IF(BK23=0,1,IF(BK23=2,1,2))","v":1},null,"Barry Kitchener",null,43,0,0,2,{"$f":"$BP$71","v":39},{"$f":"$BR$71","v":0},0,2,{"$f":"$BS$71","v":3},{"$f":"$BT$71","v":0},0,0,{"$f":"$BV$71","v":1},{"$f":"$BW$71","v":0},0,0,null,null,null,null,null,12,null,null,null,null,null,null,null,null,null,null,null,null,null,null,null,null,null,null,null,null,null,null,null,null,null,null,null,null,null,null,null,null,null,null,null,null,null,null,null,null,null,null,null,null,null,null,null,null,null,null,"Orient (H) D 1-1",14,22]
[1,null,21,"Division 2","1974-12-07",null,"22nd v 16th","Orient","(H)","D 1-1","1-0",8145,14,22,"Baldwin / Fairbrother",20,1,null,null,21,"Division 2","1974-12-07","Orient","(H)","D 1-1","King","Donaldson","Jones","Dorney","Dillon","Saul","Bolland","Summerill","Baldwin","Allder","Hill",null,null,"-",null,null,null,null,null,null,null,null,null,null,null,null,null,null,null,null,{"$f":"IF(BE25=BS26,IF(BF25=BT26,IF(BG25=BW26,IF(BH25=BX26,IF(BI25=CA26,IF(BJ25=CB26,\"OK\",\"Error\"),\"Error\"),\"Error\"),\"Error\"),\"Error\"),\"Error\")","v":"Error"},22,0,3,0,0,0,2,null,"Jon Moore",null,25,0,0,2,{"$f":"$BP$72","v":22},{"$f":"$BR$72","v":0},0,2,{"$f":"$BS$72","v":3},{"$f":"$BT$72","v":0},0,0,{"$f":"$BV$72","v":0},{"$f":"$BW$72","v":0},0,0,null,null,null,null,null,20,null,null,null,null,null,null,null,null,null,null,null,null,null,null,null,null,null,null,null,null,null,null,null,null,null,null,null,null,null,null,null,null,null,null,null,null,null,null,null,null,null,null,null,null,null,null,null,null,null,null,"Sunderland (A) L 0-2",14,21]
[2,null,22,"Division 2","1974-12-14",null,"21st v 2nd","Sunderland","(A)","L 0-2","0-1",26235,14,21,"Robson , Kerr",21,2,null,null,22,"Division 2","1974-12-14","Sunderland","(A)","L 0-2","King","Donaldson","Moore","Dillon","Dorney","Saul","Bolland","Summerill","Baldwin","Allder","Hill",null,null,"Clark",null,null,null,null,null,null,null,null,null,null,null,null,null,null,null,null,{"$f":"IF(BE26=BS25,IF(BF26=BT25,IF(BG26=BW25,IF(BH26=BX25,IF(BI26=CA25,IF(BJ26=CB25,\"OK\",\"Error\"),\"Error\"),\"Error\"),\"Error\"),\"Error\"),\"Error\")","v":"Error"},41,0,3,0,1,0,1,null,"Frank Saul",null,45,0,0,2,{"$f":"$BP$73","v":41},{"$f":"$BR$73","v":0},0,2,{"$f":"$BS$73","v":3},{"$f":"$BT$73","v":0},0,0,{"$f":"$BV$73","v":1},{"$f":"$BW$73","v":0},0,0,null,null,null,null,null,7,null,null,null,null,null,null,null,null,null,null,null,null,null,null,null,null,null,null,null,null,null,null,null,null,null,null,null,null,null,null,null,null,null,null,null,null,null,null,null,null,null,null,null,null,null,null,null,null,null,null,"Sheff Wed (H) W 2-1",16,22]
[1,null,23,"Division 2","1974-12-21",null,"22nd v 19th","Sheff Wed","(H)","W 2-1","0-0",6265,16,22,"Moore , Hazell / Brown",22,1,null,null,23,"Division 2","1974-12-21","Sheff Wed","(H)","W 2-1","King","Hazell","Moore","Dorney","Kitchener","Saul","Bolland","Summerill","Baldwin","Allder","Dillon",null,null,"-",null,null,null,null,null,null,null,null,null,null,null,null,null,null,null,null,{"$f":"IF(BE27=BS27,IF(BF27=BT27,IF(BG27=BW27,IF(BH27=BX27,IF(BI27=CA27,IF(BJ27=CB27,\"OK\",\"Error\"),\"Error\"),\"Error\"),\"Error\"),\"Error\"),\"Error\")","v":"OK"},13,0,0,0,1,0,2,null,"Derek Smethurst",null,{"$f":"BS27+BW27+CA27+CE27","v":14},0,0,{"$f":"BV27+BZ27+CD27+CH27","v":1},{"$f":"$BP$74","v":13},{"$f":"$BR$74","v":0},0,1,{"$f":"$BS$74","v":0},{"$f":"$BT$74","v":0},0,0,{"$f":"$BV$74","v":1},{"$f":"$BW$74","v":0},0,0,null,null,null,null,null,8,null,null,null,null,null,null,null,null,null,null,null,null,null,null,null,null,null,null,null,null,null,null,null,null,null,null,null,null,null,null,null,null,null,null,null,null,null,null,null,null,null,null,null,null,null,null,null,null,null,null,"Oxford (A) L 1-3",16,22]
[2,null,24,"Division 2","1974-12-26",null,"22nd v 6th","Oxford","(A)","L 1-3","1-0",8386,16,22,"Hill / Aylott, Gough , Heron",23,2,null,null,24,"Division 2","1974-12-26","Oxford","(A)","L 1-3","King","Donaldson","Moore","Dorney","Kitchener","Saul","Hazell","Summerill","Baldwin","Dillon","Hill",null,null,"-",null,null,null,null,null,null,null,null,null,null,null,null,null,null,null,null,{"$f":"IF(BE28=BS28,IF(BF28=BT28,IF(BG28=BW28,IF(BH28=BX28,IF(BI28=CA28,IF(BJ28=CB28,\"OK\",\"Error\"),\"Error\"),\"Error\"),\"Error\"),\"Error\"),\"Error\")","v":"OK"},5,0,0,0,0,0,1,null,"Wilf Smith",null,5,0,0,{"$f":"BV28+BZ28+CD28+CH28","v":0},{"$f":"$BP$75","v":5},{"$f":"$BR$75","v":0},0,0,{"$f":"$BS$75","v":0},{"$f":"$BT$75","v":0},0,0,{"$f":"$BV$75","v":0},{"$f":"$BW$75","v":0},0,0,null,null,null,null,null,22,null,null,null,null,null,null,null,null,null,null,null,null,null,null,null,null,null,null,null,null,null,null,null,null,null,null,null,null,null,null,null,null,null,null,null,null,null,null,null,null,null,null,null,null,null,null,null,null,null,null,"Portsmouth (H) D 0-0",17,22]
[1,null,25,"Division 2","1974-12-28",null,"22nd v 19th","Portsmouth","(H)","D 0-0","0-0",8116,17,22,null,24,1,null,null,25,"Division 2","1974-12-28","Portsmouth","(H)","D 0-0","King","Hazell","Moore","Donaldson","Kitchener","Dorney","Saul","Summerill","Baldwin","Clark","Hill",null,null,"Allder",null,null,null,null,null,null,null,null,null,null,null,null,null,null,null,null,{"$f":"IF(BE29=BS30,IF(BF29=BT30,IF(BG29=BW30,IF(BH29=BX30,IF(BI29=CA30,IF(BJ29=CB30,\"OK\",\"Error\"),\"Error\"),\"Error\"),\"Error\"),\"Error\"),\"Error\")","v":"Error"},20,0,3,0,0,0,2,null,"Phil Summerill",null,23,0,0,{"$f":"BV29+BZ29+CD29+CH29","v":7},{"$f":"$BP$76","v":20},{"$f":"$BR$76","v":0},0,6,{"$f":"$BS$76","v":3},{"$f":"$BT$76","v":0},0,1,{"$f":"$BV$76","v":0},{"$f":"$BW$76","v":0},0,0,null,null,null,null,null,17,null,null,null,null,null,null,null,null,null,null,null,null,null,null,null,null,null,null,null,null,null,null,null,null,null,null,null,null,null,null,null,null,null,null,null,null,null,null,null,null,null,null,null,null,null,null,null,null,null,null,"Orient (A) L 1-2",17,22]
[2,null,26,"FA Cup 3","1975-01-04",null,"-","Bury","(A)","D 2-2","0-0",7462,"-","-","Bolland (pen) , Hill / Hamstead , Williams",null,2,null,null,26,"FA Cup 3","1975-01-04","Bury","(A)","D 2-2","King","Hazell","Moore","Donaldson","Kitchener","Dorney","Saul","Summerill","Clark","Bolland","Allder",null,null,"Hill",null,null,null,null,null,null,null,null,null,null,null,null,null,null,null,null,{"$f":"IF(BE30=BS29,IF(BF30=BT29,IF(BG30=BW29,IF(BH30=BX29,IF(BI30=CA29,IF(BJ30=CB29,\"OK\",\"Error\"),\"Error\"),\"Error\"),\"Error\"),\"Error\"),\"Error\")","v":"Error"},15,1,0,0,0,0,1,null,"Alf Wood",null,15,1,0,{"$f":"BV30+BZ30+CD30+CH30","v":2},{"$f":"$BP$77","v":15},{"$f":"$BR$77","v":1},0,2,{"$f":"$BS$77","v":0},{"$f":"$BT$77","v":0},0,0,{"$f":"$BV$77","v":0},{"$f":"$BW$77","v":0},0,0,null,null,null,null,null,9,null,null,null,null,null,null,null,null,null,null,null,null,null,null,null,null,null,null,null,null,null,null,null,null,null,null,null,null,null,null,null,null,null,null,null,null,null,null,null,null,null,null,null,null,null,null,null,null,null,null,"Notts Co (H) W 3-0",19,22]
[1,null,27,"FA Cup 3 R","1975-01-07",null,"-","Bury","(H)","D 1-1 ‡","0-0",10274,"-","-","Summerill / Thomson",null,1,null,null,27,"FA Cup 3 R","1975-01-07","Bury","(H)","D 1-1 *","King","Donaldson","Moore","Dorney","Kitchener","Saul","Hazell","Bolland","Clark","Summerill","Hill",null,null,"Allder",null,null,null,null,null,null,null,null,null,null,null,null,null,null,null,null,null,null,null,null,null,null,null,2,null,null,null,null,null,null,null,null,null,null,null,null,null,null,null,null,null,null,null,null,null,null,null,null,null,null,null,null,null,null,null,null,null,null,null,null,null,null,null,null,null,null,null,null,null,null,null,null,null,null,null,null,null,null,null,null,null,null,null,null,null,null,null,null,null,null,null,null,null,null,null,null,null,null,null,"Cardiff (H) W 5-1",21,21]
[2,null,28,"Division 2","1975-01-11",null,"22nd v 16th","Orient","(A)","L 1-2","0-1",9584,17,22,"Hazell / Possee , Grealish",25,2,null,null,28,"Division 2","1975-01-11","Orient","(A)","L 1-2","King","Donaldson","Moore","Dorney","Kitchener","Saul","Hazell","Bolland","Clark","Summerill","Hill",null,null,"Allder",null,null,null,null,null,null,null,null,null,null,null,null,null,null,null,null,null,null,null,null,null,null,null,1,null,"Own Goals",null,null,null,null,{"$f":"BV32+BZ32+CD32+CH38","v":2},null,null,null,2,null,null,null,0,null,null,null,0,null,null,null,null,null,null,null,null,null,null,null,null,null,null,null,null,null,null,null,null,null,null,null,null,null,null,null,null,null,null,null,null,null,null,null,null,null,null,null,null,null,null,null,null,null,null,null,null,null,null,null,null,null,null,null,null,"Bolton (A) L 0-2",21,21]
[1,null,29,"FA Cup 3 2R","1975-01-13",null,"-","Bury","(N)","L 0-2","0-1",3041,"-","-","Riley , Duffey",null,1,null,null,29,"FA Cup 3 2R","1975-01-13","Bury","(N)","L 0-2","King","Hazell","Moore","Dorney","Kitchener","Saul","Allder","Jones","Clark","Summerill","Hill",null,null,"Bolland",null,null,null,null,null,null,null,null,null,null,null,null,null,null,null,null,null,null,null,null,null,null,null,2,null,null,null,null,null,null,null,null,null,null,null,null,null,null,null,null,null,null,null,null,null,null,null,null,null,null,null,null,null,null,null,null,null,null,null,null,null,null,null,null,null,null,null,null,null,null,null,null,null,null,null,null,null,null,null,null,null,null,null,null,null,null,null,null,null,null,null,null,null,null,null,null,null,null,null,"Oldham (H) D 0-0",22,21]
[2,null,30,"Division 2","1975-01-18",null,"22nd v 8th","Notts Co","(H)","W 3-0","1-0",4963,19,22,"Summerill (2) , Clark",26,2,null,null,30,"Division 2","1975-01-18","Notts Co","(H)","W 3-0","King","Smith","Moore","Dorney","Kitchener","Bolland","Hazell","Allder","Clark","Summerill","Hill",null,null,"Jones",null,null,null,null,null,null,null,null,null,null,null,null,null,null,null,null,null,null,null,null,null,null,null,1,null,"Goals",null,null,null,null,{"$f":"SUM(BR6:BR32)","v":47},null,null,null,{"$f":"SUM(BV6:BV32)","v":44},null,null,null,{"$f":"SUM(BZ6:BZ32)","v":3},null,null,null,{"$f":"SUM(CD6:CD32)","v":0},null,null,null,null,null,null,null,null,null,null,null,null,null,null,null,null,null,null,null,null,null,null,null,null,null,null,null,null,null,null,null,null,null,null,null,null,null,null,null,null,null,null,null,null,null,null,null,null,null,null,null,null,null,null,null,null,"Cardiff (A) W 1-0",24,19]
[1,null,31,"Division 2","1975-01-25",null,"21st v 19th","Cardiff","(H)","W 5-1","1-0",8101,21,21,"Evans , Summerill (3) , Kitchener / Reece",27,1,null,null,31,"Division 2","1975-01-25","Cardiff","(H)","W 5-1","King","Smith","Moore","Hazell","Kitchener","Saul","Evans","Bolland","Clark","Summerill","Allder",null,null,"-",null,null,null,null,null,null,null,null,null,null,null,null,null,null,null,null,null,null,null,null,null,null,null,2,null,null,null,null,null,null,null,null,null,null,null,null,null,null,null,null,null,null,null,null,null,null,null,null,null,null,null,null,null,null,null,null,null,null,null,null,null,null,null,null,null,null,null,null,null,null,null,null,null,null,null,null,null,null,null,null,null,null,null,null,null,null,null,null,null,null,null,null,null,null,null,null,null,null,null,"York (H) L 1-3",24,20]
[2,null,32,"Division 2","1975-02-01",null,"20th v 12th","Bolton","(A)","L 0-2","0-1",12920,21,21,"Lee , Byrom",28,2,null,null,32,"Division 2","1975-02-01","Bolton","(A)","L 0-2","King","Smith","Moore","Evans","Kitchener","Hazell","Saul","Bolland","Clark","Summerill","Allder",null,null,"C Kelly",null,null,null,null,null,null,null,null,null,null,null,null,null,null,null,null,null,null,null,null,null,null,null,null,null,null,null,null,null,null,null,null,null,null,null,null,null,null,null,null,null,null,null,null,null,null,null,null,null,null,null,null,null,null,null,null,null,null,null,null,null,null,null,null,null,null,null,null,null,null,null,null,null,null,null,null,null,null,null,null,null,null,null,null,null,null,null,null,null,null,null,null,null,null,null,null,null,null,null,"Fulham (A) D 0-0",25,20]
[1,null,33,"Division 2","1975-02-08",null,"21st v 18th","Oldham","(H)","D 0-0","0-0",9325,22,21,null,29,1,null,null,33,"Division 2","1975-02-08","Oldham","(H)","D 0-0","King","Smith","Moore","Evans","Kitchener","Allder","Hazell","Saul","Clark","Summerill","C Kelly",null,null,"Hill",null,null,null,null,null,null,null,null,null,null,null,null,null,null,null,null,null,null,null,null,null,null,null,null,null,null,null,null,null,null,null,null,null,null,null,null,null,null,null,null,null,null,null,null,null,null,null,null,null,null,null,null,null,null,null,null,null,null,null,null,null,null,null,null,null,null,null,null,null,null,null,null,null,null,null,null,null,null,null,null,null,null,null,null,null,null,null,null,null,null,null,null,null,null,null,null,null,null,null,"Hull City (H) W 2-0",27,19]
[2,null,34,"Division 2","1975-02-14",null,"21st v 20th","Cardiff","(A)","W 1-0","0-0",6598,24,19,"Saul",30,2,null,null,34,"Division 2","1975-02-14","Cardiff","(A)","W 1-0","King","Smith","Moore","Evans","Kitchener","Saul","Dorney","Hazell","C Kelly","Summerill","Hill",null,null,"Clark",null,null,null,null,null,null,null,null,null,null,null,null,null,null,null,null,null,null,null,null,null,null,null,null,null,null,null,null,"Check",null,null,{"$f":"SUM(BS6:BS30)","v":462},{"$f":"SUM(BT6:BT30)","v":24},null,null,{"$f":"SUM(BW6:BW30)","v":33},{"$f":"SUM(BX6:BX30)","v":3},null,null,{"$f":"SUM(CA6:CA30)","v":11},{"$f":"SUM(CB6:CB30)","v":0},null,null,null,null,null,null,null,null,null,null,null,null,null,null,null,null,null,null,null,null,null,null,null,null,null,null,null,null,null,null,null,null,null,null,null,null,null,null,null,null,null,null,null,null,null,null,null,null,null,null,null,null,null,null,null,null,null,null,"Bristol C (A) L 1-2",27,19]
[1,null,35,"Division 2","1975-02-22",null,"19th v 15th","York","(H)","L 1-3","0-1",9018,24,20,"Summerill / Jones (2) , Cave",31,1,null,null,35,"Division 2","1975-02-22","York","(H)","L 1-3","King","Evans","Moore","Hazell","Kitchener","Dorney","Saul","Bolland","C Kelly","Summerill","Allder",null,null,"-",null,null,null,null,null,null,null,null,null,null,null,null,null,null,null,null,null,null,null,null,null,null,null,null,null,null,null,null,null,null,null,null,null,null,null,null,null,null,null,null,null,null,null,null,null,null,null,null,null,null,null,null,null,null,null,null,null,null,null,null,null,null,null,null,null,null,null,null,null,null,null,null,null,null,null,null,null,null,null,null,null,null,null,null,null,null,null,null,null,null,null,null,null,null,null,null,null,null,null,"Blackpool (H) D 0-0",28,20]
[2,null,36,"Division 2","1975-03-04",null,"20th v 12th","Fulham","(A)","D 0-0","0-0",13315,25,20,null,32,2,null,null,36,"Division 2","1975-03-04","Fulham","(A)","D 0-0","King","Donaldson","Moore","Dorney","Kitchener","Saul","Hazell","Jones","C Kelly","Summerill","Smethurst",null,null,"Allder",null,null,null,null,null,null,null,null,null,null,null,null,null,null,null,null,null,null,null,null,null,null,null,null,null,null,null,null,null,null,null,{"$f":"BS38/11","v":42},null,null,null,null,null,null,null,null,null,null,null,null,null,null,null,null,null,null,null,null,null,null,null,null,null,null,null,null,null,null,null,null,null,null,null,null,null,null,null,null,null,null,null,null,null,null,null,null,null,null,null,null,null,null,null,null,null,null,null,null,null,null,null,null,null,null,null,"Sheff Wed (A) W 1-0",30,20]
[1,null,37,"Division 2","1975-03-08",null,"20th v 9th","Hull City","(H)","W 2-0","2-0",6912,27,19,"Moore , Clark",33,1,null,null,37,"Division 2","1975-03-08","Hull City","(H)","W 2-0","King","Donaldson","Moore","Hazell","Kitchener","Dorney","Saul","Smethurst","Clark","Summerill","Jones",null,null,"-",null,null,null,null,null,null,null,null,null,null,null,null,null,null,null,null,null,null,null,null,null,null,null,null,null,null,null,null,null,null,null,null,null,null,null,null,null,null,null,null,null,null,null,null,null,null,null,null,null,null,null,null,null,null,null,null,null,null,null,null,null,null,null,null,null,null,null,null,null,null,null,null,null,null,null,null,null,null,null,null,null,null,null,null,null,null,null,null,null,null,null,null,null,null,null,null,null,null,null,"Portsmouth (A) L 0-1",30,19]
[2,null,38,"Division 2","1975-03-15",null,"19th v 6th","Bristol C","(A)","L 1-2","0-1",12393,27,19,"Clark / Fear , Mann",34,2,null,null,38,"Division 2","1975-03-15","Bristol C","(A)","L 1-2","King","Donaldson","Moore","Dorney","Kitchener","Saul","Hazell","Jones","Clark","Summerill","Smethurst",null,null,"C Kelly",null,null,null,null,null,null,null,null,null,null,null,null,null,null,null,null,null,null,null,null,null,null,null,null,null,null,null,null,null,null,null,null,null,null,null,null,null,null,null,null,null,null,null,null,null,null,null,null,null,null,null,null,null,null,null,null,null,null,null,null,null,null,null,null,null,null,null,null,null,null,null,null,null,null,null,null,null,null,null,null,null,null,null,null,null,null,null,null,null,null,null,null,null,null,null,null,null,null,null,"Aston Villa (H) L 1-3",30,20]
[1,null,39,"Division 2","1975-03-22",null,"19th v 6th","Blackpool","(H)","D 0-0","0-0",7506,28,20,null,35,1,null,null,39,"Division 2","1975-03-22","Blackpool","(H)","D 0-0","King","Evans","Moore","Hazell","Kitchener","Burnett","Saul","Clark","C Kelly","Summerill","Allder",null,null,"-",null,null,null,null,null,null,null,null,null,null,null,null,null,null,null,null,null,null,null,null,null,null,null,null,null,null,null,null,null,null,null,null,null,null,null,null,null,null,null,null,null,null,null,null,null,null,null,null,null,null,null,null,null,null,null,null,null,null,null,null,null,null,null,null,null,null,null,null,null,null,null,null,null,null,null,null,null,null,null,null,null,null,null,null,null,null,null,null,null,null,null,null,null,null,null,null,null,null,null,"West Brom (A) L 1-2",30,21]
[2,null,40,"Division 2","1975-03-29",null,"20th v 22nd","Sheff Wed","(A)","W 1-0","0-0",8171,30,20,"Burnett",36,2,null,null,40,"Division 2","1975-03-29","Sheff Wed","(A)","W 1-0","King","Evans","Moore","Burnett","Kitchener","Saul","Hazell","Clark","C Kelly","Summerill","Dorney",null,null,"Hill",null,null,null,null,null,null,null,null,null,null,null,null,null,null,null,null,null,null,null,null,null,null,null,null,null,null,null,null,null,null,null,null,null,null,null,null,null,null,null,null,null,null,null,null,null,null,null,null,null,null,null,null,null,null,null,null,null,null,null,null,null,null,null,null,null,null,null,null,null,null,null,null,null,null,null,null,null,null,null,null,null,null,null,null,null,null,null,null,null,null,null,null,null,null,null,null,null,null,null,"Norwich (H) D 1-1",31,21]
[1,null,41,"Division 2","1975-03-31",null,"19th v 17th","Portsmouth","(A)","L 0-1","0-0",14329,30,19,"Kitchener (og)",37,1,null,null,41,"Division 2","1975-03-31","Portsmouth","(A)","L 0-1","King","Evans","Moore","Dorney","Kitchener","Saul","Hazell","Burnett","C Kelly","Summerill","Hill",null,null,"-",null,null,null,null,null,null,null,null,null,null,null,null,null,null,null,null,null,null,null,null,null,null,null,null,null,null,null,null,null,null,null,null,null,null,null,null,null,null,null,null,null,null,null,null,null,null,null,null,null,null,null,null,null,null,null,null,null,null,null,null,null,null,null,null,null,null,null,null,null,null,null,null,null,null,null,null,null,null,null,null,null,null,null,null,null,null,null,null,null,null,null,null,null,null,null,null,null,null,null,"Southampton (A) L 2-3",31,21]
[2,null,42,"Division 2","1975-04-01",null,"19th v 3rd","Aston Villa","(H)","L 1-3","1-1",13115,30,20,"Burnett / Hamilton (pen) , Leonard , Little",38,2,null,null,42,"Division 2","1975-04-01","Aston Villa","(H)","L 1-3","King","Evans","Moore","Burnett","Kitchener","Saul","Hazell","Clark","C Kelly","Bolland","Allder",null,null,"Hill",null,null,null,null,null,null,null,null,null,null,null,null,null,null,null,null,null,null,null,null,null,null,null,null,null,null,null,null,null,null,null,null,null,null,null,null,null,null,null,null,null,null,null,null,null,null,null,null,null,null,null,null,null,null,null,null,null,null,null,null,null,null,null,null,null,null,null,null,null,null,null,null,null,null,null,null,null,null,null,null,null,null,null,null,null,null,null,null,null,null,null,null,null,null,null,null,null,null,null,"Bristol R (H) D 1-1",32,20]
[1,null,43,"Division 2","1975-04-05",null,"21st v 8th","West Brom","(A)","L 1-2","0-0",8147,30,21,"Allder / T Brown (2)",39,1,null,null,43,"Division 2","1975-04-05","West Brom","(A)","L 1-2","King","Evans","Moore","Hazell","Kitchener","Saul","Burnett","Clark","C Kelly","Summerill","Bolland",null,null,"Allder",null,null,null,null,null,null,null,null,null,null,null,null,null,null,null,null,null,null,null,null,null,null,null,26]
[2,null,44,"Division 2","1975-04-12",null,"21st v 4th","Norwich","(H)","D 1-1","1-0",10565,31,21,"Kitchener / Butler",40,2,null,null,44,"Division 2","1975-04-12","Norwich","(H)","D 1-1","King","Evans","Moore","Dorney","Kitchener","Saul","Hazell","Burnett","Clark","Bolland","Allder",null,null,"-",null,null,null,null,null,null,null,null,null,null,null,null,null,null,null,null,null,null,null,null,null,null,null,{"$f":"8*11","v":88}]
[1,null,45,"Division 2","1975-04-18",null,"21st v 13th","Southampton","(A)","L 2-3","0-2",13516,31,21,"Peach (og) , Bolland / Osgood (2) , Channon (pen)",41,1,null,null,45,"Division 2","1975-04-18","Southampton","(A)","L 2-3","King","Evans","Moore","Dorney","Kitchener","Saul","Hazell","Donaldson","Clark","Bolland","Allder",null,null,"Hill",null,null,null,null,null,null,null,null,null,null,null,null,null,null,null,null,null,null,null,null,null,null,null,28]
[2,null,46,"Division 2","1975-04-26",null,"21st v 19th","Bristol R","(H)","D 1-1","1-1",6243,32,20,"Donaldson / Warboys",42,2,null,null,46,"Division 2","1975-04-26","Bristol R","(H)","D 1-1","King","Evans","Moore","Dorney","Kitchener","Saul","Hazell","Donaldson","Clark","Allder","Hill",null,null,"-",null,null,null,null,null,null,null,null,null,null,null,null,null,null,null,null,null,null,null,null,null,null,null,29]
[1,null,null,null,null,null,null,null,null,null,null,null,null,null,null,null,1,null,null,null,null,null,null,null,null,null,null,null,null,null,null,null,null,null,null,null,null,null,null,null,null,null,null,null,null,null,null,null,null,null,null,null,null,null,null,null,null,null,null,null,null,null,null,null,null,null,null,"League",null,null,"FA Cup",null,null,"League Cup"]
[{"$f":"IF(A51=0,1,IF(A51=2,1,2))","v":2},null,null,"‡ After extra time, 0-0 at 90 mins     (N) 2nd Replay at Neutral Ground, West Brom's The Hawthorns"]
[null,null,null,null,null,null,null,null,null,null,null,null,null,null,null,null,null,null,null,null,null,null,null,null,null,null,null,null,null,null,null,null,null,null,null,null,null,null,null,null,null,null,null,null,null,null,null,null,null,null,null,null,null,null,null,null,null,null,null,null,null,null,null,null,{"$f":"BN53&\"**\"","v":"Allder**"},"Allder",null,{"$f":"COUNTIF(LeagueStarts,$BM53)","v":26},null,{"$f":"COUNTIF(LeagueSubs,$BM53)","v":5},{"$f":"COUNTIF($Z$126:$AJ$135,$BM53)","v":2},{"$f":"COUNTIF($AM$126:$AM$135,$BM53)","v":1},null,{"$f":"COUNTIF($Z$136:$AJ$141,$BM53)","v":0},{"$f":"COUNTIF($AM$136:$AM$141,$BM54)","v":0},null,null,null,null,null,null,"Doug",null,null,null,null,null,null,{"$f":"CD53&\" \"&CL53","v":"Doug Allder"},"Allder",4]
[null,null,null,null,null,null,null,null,null,null,null,null,null,null,null,null,null,null,null,null,null,null,null,null,null,null,null,null,null,null,null,null,null,null,null,null,null,null,null,null,null,null,null,null,null,null,null,null,null,null,null,null,null,null,null,null,null,null,null,null,null,null,null,null,{"$f":"BN54&\"**\"","v":"Baldwin**"},"Baldwin",null,6,null,{"$f":"COUNTIF(LeagueSubs,$BM54)","v":0},0,0,null,0,0,null,null,null,null,null,null,"Tommy",null,null,null,null,null,null,"Tommy Baldwin","Baldwin",0]
[null,null,null,null,null,null,null,null,null,null,null,null,null,null,null,null,null,null,null,null,null,null,null,null,null,null,null,null,null,null,null,null,null,null,null,null,null,null,null,null,null,null,null,null,null,null,null,null,null,null,null,null,null,null,null,null,null,null,null,null,null,null,null,null,{"$f":"BN55&\"**\"","v":"Bolland**"},"Bolland",null,28,null,{"$f":"COUNTIF(LeagueSubs,$BM55)","v":1},2,1,null,1,0,null,null,null,null,null,null,"Gordon",null,null,null,null,null,null,"Gordon Bolland","Bolland",0]
[null,null,null,null,null,null,null,null,null,null,null,null,null,null,{"$f":"SUMIF(I5:I50,I5,L5:L49)","v":189832},null,null,null,null,null,null,null,null,null,null,null,null,null,null,null,null,null,null,null,null,null,null,null,null,null,null,null,null,null,null,null,null,null,null,null,null,null,null,null,null,null,null,null,null,null,null,null,null,null,"B Brown**","B Brown",null,9,null,0,0,0,null,0,0,null,null,null,null,null,null,"Bryan",null,null,null,null,null,null,"Bryan Brown","Brown",0]
[null,null,null,null,null,null,null,null,null,null,null,null,null,null,{"$f":"L31","v":10274},null,null,null,null,null,null,null,null,null,null,null,null,null,null,null,null,null,null,null,null,null,null,null,null,null,null,null,null,null,null,null,null,null,null,null,null,null,null,null,null,null,null,null,null,null,null,null,null,null,"S Brown**","S Brown",null,1,null,4,0,0,null,0,0,null,null,null,null,null,null,"Steve",null,null,null,null,null,null,"Steve Brown","Brown",1]
[null,null,null,null,null,null,null,null,null,null,null,null,null,null,{"$f":"O56-O57","v":179558},null,null,null,null,null,null,null,null,null,null,null,null,null,null,null,null,null,null,null,null,null,null,null,null,null,null,null,null,null,null,null,null,null,null,null,null,null,null,null,null,null,null,null,null,null,null,null,null,null,"Burnett**","Burnett",null,6,null,0,0,0,null,0,0,null,null,null,null,null,null,"Dennis",null,null,null,null,null,null,"Dennis Burnett","Burnett",0]
[null,null,null,null,null,null,null,null,null,null,null,null,null,null,{"$f":"O58/21","v":8550.3809523809523},null,null,null,null,null,null,null,null,null,null,null,null,null,null,null,null,null,null,null,null,null,null,null,null,null,null,null,null,null,null,null,null,null,null,null,null,null,null,null,null,null,null,null,null,null,null,null,null,null,"Clark**","Clark",null,25,null,5,3,0,null,1,0,null,null,null,null,null,null,"Brian",null,null,null,null,null,null,"Brian Clark","Clark",0]
[null,null,null,null,null,null,null,null,null,null,null,null,null,null,null,null,null,null,null,null,null,null,null,null,null,null,null,null,null,null,null,null,null,null,null,null,null,null,null,null,null,null,null,null,null,null,null,null,null,null,null,null,null,null,null,null,null,null,null,null,null,null,null,null,"Cripps**","Cripps",null,1,null,0,0,0,null,0,0,null,null,null,null,null,null,"Harry",null,null,null,null,null,null,"Harry Cripps","Cripps",0]
[null,null,null,null,null,null,null,null,null,null,null,null,null,null,null,null,null,null,null,null,null,null,null,null,null,null,null,null,null,null,null,null,null,null,null,null,null,null,null,null,null,null,null,null,null,null,null,null,null,null,null,null,null,null,null,null,null,null,null,null,null,null,null,null,"Dillon**","Dillon",null,4,null,0,0,0,null,0,0,null,null,null,null,null,null,"Michael",null,null,null,null,null,null,"Michael Dillon","Dillon",1]
[null,null,null,null,null,null,null,null,null,null,null,null,null,null,"Div 2",null,null,null,null,null,null,null,null,null,null,null,null,null,null,null,null,null,null,null,null,null,null,null,null,null,null,null,null,null,null,null,null,null,null,null,null,null,null,null,null,null,null,null,null,null,null,null,null,null,"Donaldson**","Donaldson",null,29,null,0,2,0,null,1,0,null,null,null,null,null,null,"Dave",null,null,null,null,null,null,"Dave Donaldson","Donaldson",8]
[null,null,null,null,null,null,null,null,null,null,null,null,null,null,null,null,null,null,null,null,null,null,null,null,null,null,null,null,null,null,null,null,null,null,null,null,null,null,null,null,null,null,null,null,null,null,null,null,null,null,null,null,null,null,null,null,null,null,null,null,null,null,null,null,"Dorney**","Dorney",null,36,null,0,3,0,null,1,0,null,null,null,null,null,null,"Alan",null,null,null,null,null,null,"Alan Dorney","Dorney",0]
[null,null,null,null,null,null,null,null,null,null,null,null,null,null,null,null,null,null,null,null,null,null,null,null,null,null,null,null,null,null,null,null,null,null,null,null,null,null,null,null,null,null,null,null,null,null,null,null,null,null,null,null,null,null,null,null,null,null,null,null,null,null,null,null,"Evans**","Evans",null,13,null,0,0,0,null,0,0,null,null,null,null,null,null,"Ray",null,null,null,null,null,null,"Ray Evans","Evans",5]
[null,null,null,null,null,null,null,"1974-08-17",null,null,null,10572,null,"w",null,null,null,null,null,null,null,null,null,null,null,null,null,null,null,null,null,null,null,null,null,null,null,null,null,null,null,null,null,null,null,null,null,null,null,null,null,null,null,null,null,null,null,null,null,null,null,null,null,null,"Hazell**","Hazell",null,21,null,0,3,0,null,0,0,null,null,null,null,null,null,"Tony",null,null,null,null,null,null,"Tony Hazell","Hazell",6]
[null,null,null,null,null,null,null,"1974-08-19",null,null,null,7509,null,"m",null,null,null,null,null,null,null,null,null,null,null,null,null,null,null,null,null,null,null,null,null,null,null,null,null,null,null,null,null,null,null,null,null,null,null,null,null,null,null,null,null,null,null,null,null,null,null,null,null,null,"Hill**","Hill",null,26,null,5,2,1,null,1,0,null,null,null,null,null,null,"Gordon",null,null,null,null,null,null,"Gordon Hill","Hill",3]
[null,null,null,null,null,null,null,"1974-08-31",null,null,null,9936,null,"w",null,null,null,null,null,null,null,null,null,null,null,null,null,null,null,null,null,null,null,null,null,null,null,null,null,null,null,null,null,null,null,null,null,null,null,null,null,null,null,null,null,null,null,null,null,null,null,null,null,null,"Jones**","Jones",null,19,null,1,1,0,null,1,0,null,null,null,null,null,null,"Eddie",null,null,null,null,null,null,"Eddie Jones","Jones",1]
[null,null,null,null,null,null,null,"1974-09-14",null,null,null,5908,null,"w",null,null,null,null,null,null,null,null,null,null,null,null,null,null,null,null,null,null,null,null,null,null,null,null,null,null,null,null,null,null,null,null,null,null,null,null,null,null,null,null,null,null,null,null,null,null,null,null,null,null,"C Kelly**","C Kelly",null,9,null,2,0,0,null,0,0,null,null,null,null,null,null,"Chris",null,null,null,null,null,null,"Chris Kelly","Kelly",6]
[null,null,null,null,null,null,null,"1974-09-16",null,null,null,16988,null,"m",null,null,null,null,null,null,null,null,null,null,null,null,null,null,null,null,null,null,null,null,null,null,null,null,null,null,null,null,null,null,null,null,null,null,null,null,null,null,null,null,null,null,null,null,null,null,null,null,null,null,"M Kelly**","M Kelly",null,6,null,0,0,0,null,1,0,null,null,null,null,null,null,"Michael",null,null,null,null,null,null,"Michael Kelly","Kelly",2]
[null,null,null,null,null,null,null,"1974-09-28",null,null,null,5750,null,"w",null,null,null,null,null,null,null,null,null,null,null,null,null,null,null,null,null,null,null,null,null,null,null,null,null,null,null,null,null,null,null,null,null,null,null,null,null,null,null,null,null,null,null,null,null,null,null,null,null,null,"King**","King",null,42,null,0,3,0,null,1,0,null,null,null,null,null,null,"Bryan",null,null,null,null,null,null,{"$f":"CD70&\" \"&CL70","v":"Bryan King"},"King",3]
[null,null,null,null,null,null,null,"1974-10-12",null,null,null,9306,null,"w",null,null,null,null,null,null,null,null,null,null,null,null,null,null,null,null,null,null,null,null,null,null,null,null,null,null,null,null,null,null,null,null,null,null,null,null,null,null,null,null,null,null,null,null,null,null,null,null,null,null,"Kitchener**","Kitchener",null,39,null,0,3,0,null,1,0,null,null,null,null,null,null,"Barry",null,null,null,null,null,null,"Barry Kitchener","Kitchener",8]
[null,null,null,null,null,null,null,"1974-10-26",null,null,null,8179,null,"w",null,null,null,null,null,null,null,null,null,null,null,null,null,null,null,null,null,null,null,null,null,null,null,null,null,null,null,null,null,null,null,null,null,null,null,null,null,null,null,null,null,null,null,null,null,null,null,null,null,null,"Moore**","Moore",null,22,null,0,3,0,null,0,0,null,null,null,null,null,null,"Jon",null,null,null,null,null,null,"Jon Moore","Moore",4]
[null,null,null,null,null,null,null,"1974-11-09",null,null,null,7136,null,"w",null,null,null,null,null,null,null,null,null,null,null,null,null,null,null,null,null,null,null,null,null,null,null,null,null,null,null,null,null,null,null,null,null,null,null,null,null,null,null,null,null,null,null,null,null,null,null,null,null,null,{"$f":"BN73&\"**\"","v":"Saul**"},"Saul",null,41,null,{"$f":"COUNTIF(LeagueSubs,$BM73)","v":0},3,0,null,1,0,null,null,null,null,null,null,"Frank",null,null,null,null,null,null,"Frank Saul","Saul",1]
[null,null,null,null,null,null,null,"1974-12-07",null,null,null,8145,null,"w",null,null,null,null,null,"Game","Competition","Date","Opponents",null,"Score",1,2,3,4,5,6,7,8,9,10,11,null,null,12,null,null,null,null,null,null,null,null,null,null,null,null,null,null,null,null,null,null,null,null,null,null,null,null,null,{"$f":"BN74&\"**\"","v":"Smethurst**"},"Smethurst",null,13,null,{"$f":"COUNTIF(LeagueSubs,$BM74)","v":0},0,0,null,1,0,null,null,null,null,null,null,"Derek",null,null,null,null,null,null,"Derek Smethurst","Smethurst",1]
[null,null,null,null,null,null,null,"1974-12-21",null,null,null,6265,null,"w",null,null,null,null,null,1,"Division 2","1974-08-17","Sunderland","(H)","L 1-4","King","B Brown","Cripps","Donaldson","Dorney","Allder","Saul","Smethurst","Wood","Clark","Hill","-",null,"-",null,null,null,null,null,null,null,null,null,null,null,null,null,null,null,null,null,null,null,null,null,null,null,null,null,{"$f":"BN75&\"**\"","v":"Smith**"},"Smith",null,5,null,{"$f":"COUNTIF(LeagueSubs,$BM75)","v":0},0,0,null,0,0,null,null,null,null,null,null,"Wilf",null,null,null,null,null,null,"Wilf Smith","Smith"]
[null,null,null,null,null,null,null,"1974-12-28",null,null,null,8116,null,"w",null,null,null,null,null,2,"Division 2","1974-08-19","Nottm Forest","(H)","W 3-0","King","Donaldson","B Brown","Dorney","Kitchener","Saul","Smethurst","Wood","Clark","M Kelly ()","Hill","S Brown ()",null,"S Brown",null,null,null,null,null,null,null,null,null,null,null,null,null,null,null,null,null,null,null,null,null,null,null,null,null,{"$f":"BN76&\"**\"","v":"Summerill**"},"Summerill",null,20,null,{"$f":"COUNTIF(LeagueSubs,$BM76)","v":0},3,0,null,0,0,null,null,null,null,null,null,"Phil",null,null,null,null,null,null,"Phil Summerill","Summerill"]
[null,null,null,null,null,null,null,"1975-01-18",null,null,null,4963,null,"w",null,null,null,null,null,3,"Division 2","1974-08-24","Man Utd","(A)","L 0-4","King","Donaldson","B Brown","Dorney","Kitchener","Saul","Smethurst","Wood","Clark ()","M Kelly","Hill","Bolland ()",null,"Bolland",null,null,null,null,null,null,null,null,null,null,null,null,null,null,null,null,null,null,null,null,null,null,null,null,null,{"$f":"BN77&\"**\"","v":"Wood**"},"Wood",null,15,null,{"$f":"COUNTIF(LeagueSubs,$BM77)","v":1},0,0,null,0,0,null,null,null,null,null,null,"Alf",null,null,null,null,null,null,"Alf Wood","Wood"]
[null,null,null,null,null,null,null,"1975-01-25",null,null,null,8101,null,"w",null,null,null,null,null,4,"Division 2","1974-08-27","Nottm Forest","(A)","L 1-2","King","Donaldson","B Brown","Dorney","Kitchener","Saul","Smethurst","Wood","Bolland","M Kelly","Hill","-",null,"-"]
[null,null,null,null,null,null,null,"1975-02-08",null,null,null,9325,null,"w",null,null,null,null,null,5,"Division 2","1974-08-31","Fulham","(H)","W 2-0","King","Donaldson","Jones","Dorney","Kitchener","Saul","Smethurst","M Kelly","Wood","Bolland","Hill","-",null,"-"]
[null,null,null,null,null,null,null,"1975-02-22",null,null,null,9018,null,"w",null,null,null,null,null,6,"Division 2","1974-09-07","Blackpool","(A)","L 0-1","King","Donaldson","Jones","Dorney","Kitchener","Saul","Smethurst","Bolland","Wood","M Kelly","Hill ()","Allder ()",null,"Allder"]
[null,null,null,null,null,null,null,"1975-03-08",null,null,null,6912,null,"w",null,null,null,null,null,7,"Division 2","1974-09-14","Oxford","(H)","D 0-0","King","Donaldson","Jones","Dorney","Kitchener","Saul","Smethurst","Bolland","Wood","M Kelly ()","Hill","Clark ()",null,"Clark"]
[null,null,null,null,null,null,null,"1975-03-22",null,null,null,7506,null,"w",null,null,null,null,null,8,"Division 2","1974-09-16","Man Utd","(H)","L 0-1","King","Donaldson","Jones","Dorney","Kitchener","Saul","Bolland","Clark","Wood","Allder","Hill","-",null,"-"]
[null,null,null,null,null,null,null,"1975-04-01",null,null,null,13115,null,"m",null,null,null,null,null,9,"Division 2","1974-09-21","Aston Villa","(A)","L 0-3","King","Donaldson","Jones","Dorney","Kitchener","Allder","Saul","Smethurst","Wood ()","Bolland","Hill","Clark ()",null,"Clark",null,null,null,null,null,null,null,null,null,null,null,null,null,null,null,null,null,null,null,null,null,null,null,null,null,{"$f":"42*11","v":462}]
[null,null,null,null,null,null,null,"1975-04-12",null,null,null,10565,null,"w",null,null,null,null,null,10,"Division 2","1974-09-24","Hull City","(A)","D 1-1","King","B Brown","Jones","Donaldson","Kitchener","Dorney","Bolland","Saul","Smethurst","Allder","Hill","-",null,"-"]
[null,null,null,null,null,null,null,"1975-04-26",null,null,null,6243,null,"w",null,null,null,null,null,11,"Division 2","1974-09-28","Bristol C","(H)","W 1-0","King","B Brown","Jones","Donaldson","Kitchener","Dorney","Saul","Smethurst ()","Bolland","Allder","Hill","Wood ()",null,"Wood"]
[null,null,null,null,null,null,null,null,null,null,null,null,null,null,null,null,null,null,null,12,"Division 2","1974-10-05","Norwich","(A)","L 0-2","King","B Brown","Jones","Donaldson","Kitchener","Dorney","Saul","Bolland","Wood","Allder","Hill","-",null,"-"]
[null,null,null,null,null,null,null,null,null,null,null,null,null,null,null,null,null,null,null,13,"Division 2","1974-10-12","Southampton","(H)","W 4-0","King","B Brown","Jones","Donaldson","Kitchener","Dorney","Saul","Clark","Wood","Bolland","Allder","-",null,"-"]
[null,null,null,null,null,null,null,null,null,null,null,null,null,null,null,null,null,null,null,14,"Division 2","1974-10-19","Bristol R","(A)","L 0-2","King","B Brown","Jones","Donaldson","Kitchener","Dorney","Bolland","Saul","Wood","Clark","Allder ()","Hill ()",null,"Hill"]
[null,null,null,null,null,null,null,null,null,null,null,null,null,null,null,null,null,null,null,15,"Division 2","1974-10-26","West Brom","(H)","D 2-2","King","Donaldson","Jones","Dorney","Kitchener","Allder","Saul","Clark","Wood","Bolland","Hill ()","S Brown ()",null,"S Brown"]
[null,null,null,null,null,null,null,null,null,null,null,null,null,null,null,null,null,null,null,16,"Division 2","1974-11-02","Oldham","(A)","D 1-1","King","Donaldson","Jones","Dorney","Kitchener","Saul","Allder","Clark","Wood","Bolland","Hill ()","S Brown ()",null,"S Brown"]
[null,null,null,null,null,null,null,null,null,"Agg",null,{"$f":"SUBTOTAL(9,L65:L87)","v":179558},null,null,null,null,null,null,null,17,"Division 2","1974-11-09","Bolton","(H)","D 1-1","King","Donaldson","Jones","Dorney","Kitchener","Allder","Saul","Clark","Wood","Bolland","Hill ()","S Brown ()",null,"S Brown"]
[null,null,null,null,null,null,null,null,null,"Max",null,{"$f":"MAX(L65:L87)","v":16988},null,null,null,null,null,null,null,18,"Division 2","1974-11-16","York","(A)","L 1-2","King","Donaldson","Jones","Dorney","Kitchener","Allder","Saul","Clark","S Brown","Bolland","Hill","-",null,"-"]
[null,null,null,null,null,null,null,null,null,"Min",null,{"$f":"MIN(L65:L87)","v":4963},null,null,null,null,null,null,null,19,"Division 2","1974-11-30","Notts Co","(A)","L 1-2","King","Donaldson ()","Jones","Dorney","Kitchener","Allder","Saul","Summerill","Baldwin","Bolland","Hill","Clark ()",null,"Clark"]
[null,null,null,null,null,null,null,null,null,null,null,null,null,null,null,null,null,null,null,20,"Division 2","1974-12-07","Orient","(H)","D 1-1","King","Donaldson","Jones","Dorney","Dillon","Saul","Bolland","Summerill","Baldwin","Allder","Hill","-",null,"-"]
[null,null,null,null,null,null,null,null,null,"Av",null,{"$f":"AVERAGE(L65:L87)","v":8550.3809523809523},null,null,null,null,null,null,null,21,"Division 2","1974-12-14","Sunderland","(A)","L 0-2","King","Donaldson","Moore","Dillon","Dorney","Saul","Bolland","Summerill","Baldwin","Allder ()","Hill","Clark ()",null,"Clark"]
[null,null,null,null,null,null,null,null,null,null,null,null,null,null,null,null,null,null,null,22,"Division 2","1974-12-21","Sheff Wed","(H)","W 2-1","King","Hazell","Moore","Dorney","Kitchener","Saul","Bolland","Summerill","Baldwin","Allder","Dillon","-",null,"-"]
[null,null,null,null,null,null,null,null,null,"Weekend",null,{"$f":"SUMIF(N65:N88,\"w\",L65:L88)","v":141946},{"$f":"COUNTIF(N65:N90,\"w\")","v":18},null,null,null,null,null,null,23,"Division 2","1974-12-26","Oxford","(A)","L 1-3","King","Donaldson","Moore","Dorney","Kitchener","Saul","Hazell","Summerill","Baldwin","Dillon","Hill","-",null,"-",null,null,null,null,null,null,null,null,null,null,null,null,null,null,null,null,null,null,null,null,null,null,null,null,null,42]
[null,null,null,null,null,null,null,null,null,"Midweek",null,{"$f":"SUMIF(N65:N88,\"m\",L65:L88)","v":37612},{"$f":"COUNTIF(N65:N90,\"m\")","v":3},null,null,null,null,null,null,24,"Division 2","1974-12-28","Portsmouth","(H)","D 0-0","King","Hazell","Moore","Donaldson","Kitchener","Dorney","Saul","Summerill ()","Baldwin","Clark","Hill","Allder ()",null,"Allder",null,null,null,null,null,null,null,null,null,null,null,null,null,null,null,null,null,null,null,null,null,null,null,null,null,1]
[null,null,null,null,null,null,null,null,null,null,null,null,null,null,null,null,null,null,null,25,"Division 2","1975-01-11","Orient","(A)","L 1-2","King","Donaldson","Moore","Dorney","Kitchener","Saul","Hazell","Bolland ()","Clark","Summerill","Hill","Allder ()",null,"Allder",null,null,null,null,null,null,null,null,null,null,null,null,null,null,null,null,null,null,null,null,null,null,null,null,null,3]
[null,null,null,null,null,null,null,null,null,"Weekend",null,{"$f":"L97/M97","v":7885.8888888888887},null,null,null,null,null,null,null,26,"Division 2","1975-01-18","Notts Co","(H)","W 3-0","King","Smith","Moore","Dorney","Kitchener","Bolland","Hazell","Allder","Clark","Summerill","Hill ()","Jones ()",null,"Jones",null,null,null,null,null,null,null,null,null,null,null,null,null,null,null,null,null,null,null,null,null,null,null,null,null,{"$f":"SUM(BM97:BM99)","v":46}]
[null,null,null,null,null,null,null,null,null,"Midweek",null,{"$f":"L98/M98","v":12537.333333333334},null,null,null,null,null,null,null,27,"Division 2","1975-01-25","Cardiff","(H)","W 5-1","King","Smith","Moore","Hazell","Kitchener","Saul","Evans","Bolland","Clark","Summerill","Allder","-",null,"-"]
[null,null,null,null,null,null,null,null,null,null,null,null,null,null,null,null,null,null,null,28,"Division 2","1975-02-01","Bolton","(A)","L 0-2","King","Smith","Moore","Evans","Kitchener","Hazell","Saul","Bolland","Clark ()","Summerill","Allder","C Kelly ()",null,"C Kelly"]
[null,null,null,null,null,null,null,null,null,null,null,null,null,null,null,null,null,null,null,29,"Division 2","1975-02-08","Oldham","(H)","D 0-0","King","Smith","Moore","Evans","Kitchener","Allder","Hazell","Saul","Clark ()","Summerill","C Kelly","Hill ()",null,"Hill"]
[null,null,null,null,null,null,null,null,null,null,null,null,null,null,null,null,null,null,null,30,"Division 2","1975-02-14","Cardiff","(A)","W 1-0","King","Smith","Moore","Evans","Kitchener","Saul","Dorney","Hazell","C Kelly","Summerill ()","Hill","Clark ()",null,"Clark"]
[null,null,null,null,null,null,null,null,null,null,null,null,null,null,null,null,null,null,null,31,"Division 2","1975-02-22","York","(H)","L 1-3","King","Evans","Moore","Hazell","Kitchener","Dorney","Saul","Bolland","C Kelly","Summerill","Allder","-",null,"-"]
[null,null,null,null,null,null,null,null,null,null,null,null,null,null,null,null,null,null,null,32,"Division 2","1975-03-04","Fulham","(A)","D 0-0","King","Donaldson","Moore","Dorney","Kitchener","Saul","Hazell","Jones","C Kelly","Summerill","Smethurst ()","Allder ()",null,"Allder"]
[null,null,null,null,null,null,null,null,null,null,null,null,null,null,null,null,null,null,null,33,"Division 2","1975-03-08","Hull City","(H)","W 2-0","King","Donaldson","Moore","Hazell","Kitchener","Dorney","Saul","Smethurst","Clark","Summerill","Jones","-",null,"-"]
[null,null,null,null,null,null,null,null,null,null,null,null,null,null,null,null,null,null,null,34,"Division 2","1975-03-15","Bristol C","(A)","L 1-2","King","Donaldson","Moore","Dorney","Kitchener","Saul","Hazell","Jones","Clark","Summerill","Smethurst ()","C Kelly ()",null,"C Kelly"]
[null,null,null,null,null,null,null,null,null,null,null,null,null,null,null,null,null,null,null,35,"Division 2","1975-03-22","Blackpool","(H)","D 0-0","King","Evans","Moore","Hazell","Kitchener","Burnett","Saul","Clark","C Kelly","Summerill","Allder","-",null,"-"]
[null,null,null,null,null,null,null,null,null,null,null,null,null,null,null,null,null,null,null,36,"Division 2","1975-03-29","Sheff Wed","(A)","W 1-0","King","Evans","Moore","Burnett","Kitchener","Saul","Hazell","Clark","C Kelly","Summerill","Dorney","Hill ()",null,"Hill"]
[null,null,null,null,null,null,null,null,null,null,null,null,null,null,null,null,null,null,null,37,"Division 2","1975-03-31","Portsmouth","(A)","L 0-1","King","Evans","Moore","Dorney","Kitchener","Saul","Hazell","Burnett","C Kelly","Summerill","Hill","-",null,"-"]
[null,null,null,null,null,null,null,null,null,null,null,null,null,null,null,null,null,null,null,38,"Division 2","1975-04-01","Aston Villa","(H)","L 1-3","King","Evans","Moore","Burnett","Kitchener","Saul","Hazell","Clark","C Kelly ()","Bolland","Allder","Hill ()",null,"Hill"]
[null,null,null,null,null,null,null,null,null,null,null,null,null,null,null,null,null,null,null,39,"Division 2","1975-04-05","West Brom","(A)","L 1-2","King","Evans","Moore","Hazell","Kitchener","Saul","Burnett","Clark","C Kelly","Summerill ()","Bolland","Allder ()",null,"Allder"]
[null,null,null,null,null,null,null,null,null,null,null,null,null,null,null,null,null,null,null,40,"Division 2","1975-04-12","Norwich","(H)","D 1-1","King","Evans","Moore","Dorney","Kitchener","Saul","Hazell","Burnett","Clark","Bolland","Allder","-",null,"-"]
[null,null,null,null,null,null,null,null,null,null,null,null,null,null,null,null,null,null,null,41,"Division 2","1975-04-18","Southampton","(A)","L 2-3","King","Evans","Moore","Dorney","Kitchener","Saul","Hazell","Donaldson","Clark","Bolland","Allder ()","Hill ()",null,"Hill"]
[null,null,null,null,null,null,null,null,null,null,null,null,null,null,null,null,null,null,null,42,"Division 2","1975-04-26","Bristol R","(H)","D 1-1","King","Evans","Moore","Dorney","Kitchener","Saul","Hazell","Donaldson","Clark","Allder","Hill","-",null,"-"]
[]
[]
[]
[]
[]
[]
[]
[]
[]
[null,null,null,null,null,null,null,null,null,null,null,null,null,null,null,null,null,null,null,1,"FA Cup 3","1975-01-04","Bury","(A)","D 2-2","King","Hazell","Moore","Donaldson","Kitchener","Dorney","Saul","Summerill","Clark","Bolland","Allder ()","Hill ()",null,"Hill"]
[null,null,null,null,null,null,null,null,null,null,null,null,null,null,null,null,null,null,null,2,"FA Cup 3 R","1975-01-07","Bury","(H)","D 1-1 *","King","Donaldson","Moore","Dorney","Kitchener","Saul ()","Hazell","Bolland","Clark","Summerill","Hill","Allder ()",null,"Allder"]
[null,null,null,null,null,null,null,null,null,null,null,null,null,null,null,null,null,null,null,3,"FA Cup 3 2R","1975-01-13","Bury","(N)","L 0-2","King","Hazell","Moore","Dorney","Kitchener","Saul","Allder","Jones","Clark ()","Summerill","Hill","Bolland ()",null,"Bolland"]
[]
[]
[]
[]
[]
[]
[]
[null,null,null,null,null,null,null,null,null,null,null,null,null,null,null,null,null,null,null,1,"League Cup","1974-09-02","West Brom","(A)","L 0-1","King","Donaldson","Jones","Dorney","Kitchener","Saul","Smethurst","M Kelly","Clark","Bolland","Hill","-",null,"-"]

{"sheet":"Comparisons","index":1,"n_rows":265,"n_cols":99,"rows_kept":265,"cut":false,"hidden":false,"merged":[]}
[]
[null,null,null,null,null,null,null,null,null,null,{"$f":"IF(K3=0,0,1)","v":1},{"$f":"IF(L3=0,0,1)","v":1},1,1,1,1,1,1,1,1,1,1,1,1,1,1,1,1,1,1,1,1,1,1,1,0,0,0,0,0,0,0,0,0,null,null,null,null,null,null,null,null,null,null,null,null,null,null,null,null,null,null,null,null,null,null,null,null,null,null,null,{"$f":"IF(BT3=0,0,1)","v":1},1,1,1,1,1,1,1,1,1,1,1]
["Formulas",null,null,null,null,"Date",null,"Opponents","Venue / Result",null,{"$f":"$CM$5","v":"Allder"},{"$f":"$CM$6","v":"Baldwin"},{"$f":"$CM$7","v":"Bolland"},{"$f":"$CM$8","v":"B Brown"},{"$f":"$CM$9","v":"S Brown"},{"$f":"$CM$10","v":"Burnett"},{"$f":"$CM$11","v":"Clark"},{"$f":"$CM$12","v":"Cripps"},{"$f":"$CM$13","v":"Dillon"},{"$f":"$CM$14","v":"Donaldson"},{"$f":"$CM$15","v":"Dorney"},{"$f":"$CM$16","v":"Evans"},{"$f":"$CM$17","v":"Hazell"},{"$f":"$CM$18","v":"Hill"},{"$f":"$CM$19","v":"Jones"},{"$f":"$CM$20","v":"C Kelly"},{"$f":"$CM$21","v":"M Kelly"},{"$f":"$CM$22","v":"King"},{"$f":"$CM$23","v":"Kitchener"},{"$f":"$CM$24","v":"Moore"},{"$f":"$CM$25","v":"Saul"},{"$f":"$CM$26","v":"Smethurst"},{"$f":"$CM$27","v":"Smith"},{"$f":"$CM$28","v":"Summerill"},{"$f":"$CM$29","v":"Wood"},{"$f":"$CM$30","v":0},{"$f":"$CM$31","v":0},{"$f":"$CM$32","v":0},{"$f":"$CM$33","v":0},{"$f":"$CM$34","v":0},{"$f":"$CM$35","v":0},{"$f":"$CM$36","v":0},{"$f":"$CM$37","v":0},{"$f":"$CM$38","v":0},null,null,null,null,null,{"$f":"Millwall!$BN53&\" (**\"","v":"Allder (**"},{"$f":"Millwall!$BN54&\" (**\"","v":"Baldwin (**"},{"$f":"Millwall!$BN55&\" (**\"","v":"Bolland (**"},{"$f":"Millwall!$BN56&\" (**\"","v":"B Brown (**"},{"$f":"Millwall!$BN57&\" (**\"","v":"S Brown (**"},{"$f":"Millwall!$BN58&\" (**\"","v":"Burnett (**"},{"$f":"Millwall!$BN59&\" (**\"","v":"Clark (**"},{"$f":"Millwall!$BN60&\" (**\"","v":"Cripps (**"},{"$f":"Millwall!$BN61&\" (**\"","v":"Dillon (**"},{"$f":"Millwall!$BN62&\" (**\"","v":"Donaldson (**"},{"$f":"Millwall!$BN63&\" (**\"","v":"Dorney (**"},{"$f":"Millwall!$BN64&\" (**\"","v":"Evans (**"},{"$f":"Millwall!$BN65&\" (**\"","v":"Hazell (**"},{"$f":"Millwall!$BN66&\" (**\"","v":"Hill (**"},{"$f":"Millwall!$BN67&\" (**\"","v":"Jones (**"},{"$f":"Millwall!$BN68&\" (**\"","v":"C Kelly (**"},{"$f":"Millwall!$BN69&\" (**\"","v":"M Kelly (**"},{"$f":"Millwall!$BN70&\" (**\"","v":"King (**"},{"$f":"Millwall!$BN71&\" (**\"","v":"Kitchener (**"},{"$f":"Millwall!$BN72&\" (**\"","v":"Moore (**"},{"$f":"Millwall!$BN73&\" (**\"","v":"Saul (**"},{"$f":"Millwall!$BN74&\" (**\"","v":"Smethurst (**"},{"$f":"Millwall!$BN75&\" (**\"","v":"Smith (**"},{"$f":"Millwall!$BN76&\" (**\"","v":"Summerill (**"},{"$f":"Millwall!$BN77&\" (**\"","v":"Wood (**"},{"$f":"Millwall!$BN78&\" (**\"","v":" (**"},{"$f":"Millwall!$BN79&\" (**\"","v":" (**"},{"$f":"Millwall!$BN80&\" (**\"","v":" (**"},{"$f":"Millwall!$BN81&\" (**\"","v":" (**"},{"$f":"Millwall!$BN82&\" (**\"","v":" (**"},{"$f":"Millwall!$BN83&\" (**\"","v":" (**"},{"$f":"Millwall!$BN84&\" (**\"","v":" (**"},{"$f":"Millwall!$BN85&\" (**\"","v":" (**"},{"$f":"Millwall!$BN86&\" (**\"","v":" (**"}]
[null,null,1,null,null,null,null,null,null,null,{"$f":"$CO$5","v":"Allder**"},{"$f":"$CO$6","v":"Baldwin**"},{"$f":"$CO$7","v":"Bolland**"},{"$f":"$CO$8","v":"B Brown**"},{"$f":"$CO$9","v":"S Brown**"},{"$f":"$CO$10","v":"Burnett**"},{"$f":"$CO$11","v":"Clark**"},{"$f":"$CO$12","v":"Cripps**"},{"$f":"$CO$13","v":"Dillon**"},{"$f":"$CO$14","v":"Donaldson**"},{"$f":"$CO$15","v":"Dorney**"},{"$f":"$CO$16","v":"Evans**"},{"$f":"$CO$17","v":"Hazell**"},{"$f":"$CO$18","v":"Hill**"},{"$f":"$CO$19","v":"Jones**"},{"$f":"$CO$20","v":"C Kelly**"},{"$f":"$CO$21","v":"M Kelly**"},{"$f":"$CO$22","v":"King**"},{"$f":"$CO$23","v":"Kitchener**"},{"$f":"$CO$24","v":"Moore**"},{"$f":"$CO$25","v":"Saul**"},{"$f":"$CO$26","v":"Smethurst**"},{"$f":"$CO$27","v":"Smith**"},{"$f":"$CO$28","v":"Summerill**"},{"$f":"$CO$29","v":"Wood**"},{"$f":"$CO$30","v":"**"},{"$f":"$CO$31","v":"**"},{"$f":"$CO$32","v":"**"},{"$f":"$CO$33","v":"**"},{"$f":"$CO$34","v":"**"},{"$f":"$CO$35","v":"**"},{"$f":"$CO$36","v":"**"},{"$f":"$CO$37","v":"**"},{"$f":"$CO$38","v":"**"},null,null,null,null,null,"Allder**","Baldwin**","Bolland**","B Brown**","S Brown**","Burnett**","Clark**","Cripps**","Dillon**","Donaldson**","Dorney**","Evans**","Hazell**","Hill**","Jones**","C Kelly**","M Kelly**","King**","Kitchener**","Moore**","Saul**","Smethurst**","Smith**","Summerill**","Wood**","**","**","**","**","**","**","**","**","**"]
[null,null,{"$f":"IF(J5=0,1,0)","v":0},1,null,{"$f":"Millwall!V75","v":"1974-08-17"},null,{"$f":"Millwall!W75","v":"Sunderland"},{"$f":"Millwall!X75","v":"(H)"},{"$f":"Millwall!Y75","v":"L 1-4"},{"$f":"MATCH(K$4,Millwall!$Z75:$AK75,0)","v":6},{"$f":"MATCH(L$4,Millwall!$Z75:$AK75,0)","v":{"$error":"#N/A"}},{"$f":"MATCH(M$4,Millwall!$Z75:$AK75,0)","v":{"$error":"#N/A"}},{"$f":"MATCH(N$4,Millwall!$Z75:$AK75,0)","v":2},{"$f":"MATCH(O$4,Millwall!$Z75:$AK75,0)","v":{"$error":"#N/A"}},{"$f":"MATCH(P$4,Millwall!$Z75:$AK75,0)","v":{"$error":"#N/A"}},{"$f":"MATCH(Q$4,Millwall!$Z75:$AK75,0)","v":10},{"$f":"MATCH(R$4,Millwall!$Z75:$AK75,0)","v":3},{"$f":"MATCH(S$4,Millwall!$Z75:$AK75,0)","v":{"$error":"#N/A"}},{"$f":"MATCH(T$4,Millwall!$Z75:$AK75,0)","v":4},{"$f":"MATCH(U$4,Millwall!$Z75:$AK75,0)","v":5},{"$f":"MATCH(V$4,Millwall!$Z75:$AK75,0)","v":{"$error":"#N/A"}},{"$f":"MATCH(W$4,Millwall!$Z75:$AK75,0)","v":{"$error":"#N/A"}},{"$f":"MATCH(X$4,Millwall!$Z75:$AK75,0)","v":11},{"$f":"MATCH(Y$4,Millwall!$Z75:$AK75,0)","v":{"$error":"#N/A"}},{"$f":"MATCH(Z$4,Millwall!$Z75:$AK75,0)","v":{"$error":"#N/A"}},{"$f":"MATCH(AA$4,Millwall!$Z75:$AK75,0)","v":{"$error":"#N/A"}},{"$f":"MATCH(AB$4,Millwall!$Z75:$AK75,0)","v":1},{"$f":"MATCH(AC$4,Millwall!$Z75:$AK75,0)","v":{"$error":"#N/A"}},{"$f":"MATCH(AD$4,Millwall!$Z75:$AK75,0)","v":{"$error":"#N/A"}},{"$f":"MATCH(AE$4,Millwall!$Z75:$AK75,0)","v":7},{"$f":"MATCH(AF$4,Millwall!$Z75:$AK75,0)","v":8},{"$f":"MATCH(AG$4,Millwall!$Z75:$AK75,0)","v":{"$error":"#N/A"}},{"$f":"MATCH(AH$3,Millwall!$Z75:$AK75,0)","v":{"$error":"#N/A"}},{"$f":"MATCH(AI$3,Millwall!$Z75:$AK75,0)","v":9},{"$f":"MATCH(AJ$3,Millwall!$Z75:$AK75,0)","v":{"$error":"#N/A"}},{"$f":"MATCH(AK$3,Millwall!$Z75:$AK75,0)","v":{"$error":"#N/A"}},{"$f":"MATCH(AL$3,Millwall!$Z75:$AK75,0)","v":{"$error":"#N/A"}},{"$f":"MATCH(AM$3,Millwall!$Z75:$AK75,0)","v":{"$error":"#N/A"}},{"$f":"MATCH(AN$3,Millwall!$Z75:$AK75,0)","v":{"$error":"#N/A"}},{"$f":"MATCH(AO$3,Millwall!$Z75:$AK75,0)","v":{"$error":"#N/A"}},{"$f":"MATCH(AP$3,Millwall!$Z75:$AK75,0)","v":{"$error":"#N/A"}},{"$f":"MATCH(AQ$3,Millwall!$Z75:$AK75,0)","v":{"$error":"#N/A"}},{"$f":"MATCH(AR$3,Millwall!$Z75:$AK75,0)","v":{"$error":"#N/A"}},null,null,null,null,null,{"$f":"MATCH(AX$3,Millwall!$Z75:AK75,0)","v":{"$error":"#N/A"}},{"$f":"MATCH(AY$3,Millwall!$Z75:AK75,0)","v":{"$error":"#N/A"}},{"$f":"MATCH(AZ$3,Millwall!$Z75:AK75,0)","v":{"$error":"#N/A"}},{"$f":"MATCH(BA$3,Millwall!$Z75:AK75,0)","v":{"$error":"#N/A"}},{"$f":"MATCH(BB$3,Millwall!$Z75:AK75,0)","v":{"$error":"#N/A"}},{"$f":"MATCH(BC$3,Millwall!$Z75:AK75,0)","v":{"$error":"#N/A"}},{"$f":"MATCH(BD$3,Millwall!$Z75:AK75,0)","v":{"$error":"#N/A"}},{"$f":"MATCH(BE$3,Millwall!$Z75:AK75,0)","v":{"$error":"#N/A"}},{"$f":"MATCH(BF$3,Millwall!$Z75:AK75,0)","v":{"$error":"#N/A"}},{"$f":"MATCH(BG$3,Millwall!$Z75:AK75,0)","v":{"$error":"#N/A"}},{"$f":"MATCH(BH$3,Millwall!$Z75:AK75,0)","v":{"$error":"#N/A"}},{"$f":"MATCH(BI$3,Millwall!$Z75:AK75,0)","v":{"$error":"#N/A"}},{"$f":"MATCH(BJ$3,Millwall!$Z75:AK75,0)","v":{"$error":"#N/A"}},{"$f":"MATCH(BK$3,Millwall!$Z75:AK75,0)","v":{"$error":"#N/A"}},{"$f":"MATCH(BL$3,Millwall!$Z75:AK75,0)","v":{"$error":"#N/A"}},{"$f":"MATCH(BM$3,Millwall!$Z75:AK75,0)","v":{"$error":"#N/A"}},{"$f":"MATCH(BN$3,Millwall!$Z75:AK75,0)","v":{"$error":"#N/A"}},{"$f":"MATCH(BO$3,Millwall!$Z75:AK75,0)","v":{"$error":"#N/A"}},{"$f":"MATCH(BP$3,Millwall!$Z75:AK75,0)","v":{"$error":"#N/A"}},{"$f":"MATCH(BQ$3,Millwall!$Z75:AK75,0)","v":{"$error":"#N/A"}},{"$f":"MATCH(BR$3,Millwall!$Z75:AK75,0)","v":{"$error":"#N/A"}},{"$f":"MATCH(BS$3,Millwall!$Z75:AK75,0)","v":{"$error":"#N/A"}},{"$f":"MATCH(BT$3,Millwall!$Z75:AK75,0)","v":{"$error":"#N/A"}},{"$f":"MATCH(BU$3,Millwall!$Z75:AK75,0)","v":{"$error":"#N/A"}},{"$f":"MATCH(BV$3,Millwall!$Z75:AK75,0)","v":{"$error":"#N/A"}},{"$f":"MATCH(BW$3,Millwall!$Z75:AK75,0)","v":{"$error":"#N/A"}},{"$f":"MATCH(BX$3,Millwall!$Z75:AK75,0)","v":{"$error":"#N/A"}},{"$f":"MATCH(BY$3,Millwall!$Z75:AK75,0)","v":{"$error":"#N/A"}},{"$f":"MATCH(BZ$3,Millwall!$Z75:AK75,0)","v":{"$error":"#N/A"}},{"$f":"MATCH(CA$3,Millwall!$Z75:AK75,0)","v":{"$error":"#N/A"}},{"$f":"MATCH(CB$3,Millwall!$Z75:AK75,0)","v":{"$error":"#N/A"}},{"$f":"MATCH(CC$3,Millwall!$Z75:AK75,0)","v":{"$error":"#N/A"}},{"$f":"MATCH(CD$3,Millwall!$Z75:AK75,0)","v":{"$error":"#N/A"}},{"$f":"MATCH(CE$3,Millwall!$Z75:AK75,0)","v":{"$error":"#N/A"}},null,null,null,null,null,null,null,{"$f":"Millwall!$BN53","v":"Allder"},{"$f":"Millwall!$BN53&\" (**\"","v":"Allder (**"},{"$f":"Millwall!$BN53&\"**\"","v":"Allder**"},null,{"$f":"$CM$5","v":"Allder"},{"$f":"$CN$5","v":"Allder (**"},{"$f":"$CO$5","v":"Allder**"},null,{"$f":"Millwall!$BV$6","v":1}]
[null,null,0,2,null,{"$f":"Millwall!V76","v":"1974-08-19"},null,{"$f":"Millwall!W76","v":"Nottm Forest"},{"$f":"Millwall!X76","v":"(H)"},{"$f":"Millwall!Y76","v":"W 3-0"},{"$f":"MATCH(K$4,Millwall!$Z76:$AK76,0)","v":{"$error":"#N/A"}},{"$f":"MATCH(L$4,Millwall!$Z76:$AK76,0)","v":{"$error":"#N/A"}},{"$f":"MATCH(M$4,Millwall!$Z76:$AK76,0)","v":{"$error":"#N/A"}},{"$f":"MATCH(N$4,Millwall!$Z76:$AK76,0)","v":3},{"$f":"MATCH(O$4,Millwall!$Z76:$AK76,0)","v":12},{"$f":"MATCH(P$4,Millwall!$Z76:$AK76,0)","v":{"$error":"#N/A"}},{"$f":"MATCH(Q$4,Millwall!$Z76:$AK76,0)","v":9},{"$f":"MATCH(R$4,Millwall!$Z76:$AK76,0)","v":{"$error":"#N/A"}},{"$f":"MATCH(S$4,Millwall!$Z76:$AK76,0)","v":{"$error":"#N/A"}},{"$f":"MATCH(T$4,Millwall!$Z76:$AK76,0)","v":2},{"$f":"MATCH(U$4,Millwall!$Z76:$AK76,0)","v":4},{"$f":"MATCH(V$4,Millwall!$Z76:$AK76,0)","v":{"$error":"#N/A"}},{"$f":"MATCH(W$4,Millwall!$Z76:$AK76,0)","v":{"$error":"#N/A"}},{"$f":"MATCH(X$4,Millwall!$Z76:$AK76,0)","v":11},{"$f":"MATCH(Y$4,Millwall!$Z76:$AK76,0)","v":{"$error":"#N/A"}},{"$f":"MATCH(Z$4,Millwall!$Z76:$AK76,0)","v":{"$error":"#N/A"}},{"$f":"MATCH(AA$4,Millwall!$Z76:$AK76,0)","v":10},{"$f":"MATCH(AB$4,Millwall!$Z76:$AK76,0)","v":1},{"$f":"MATCH(AC$4,Millwall!$Z76:$AK76,0)","v":5},{"$f":"MATCH(AD$4,Millwall!$Z76:$AK76,0)","v":{"$error":"#N/A"}},{"$f":"MATCH(AE$4,Millwall!$Z76:$AK76,0)","v":6},{"$f":"MATCH(AF$4,Millwall!$Z76:$AK76,0)","v":7},{"$f":"MATCH(AG$4,Millwall!$Z76:$AK76,0)","v":{"$error":"#N/A"}},{"$f":"MATCH(AH$3,Millwall!$Z76:$AK76,0)","v":{"$error":"#N/A"}},{"$f":"MATCH(AI$3,Millwall!$Z76:$AK76,0)","v":8},{"$f":"MATCH(AJ$3,Millwall!$Z76:$AK76,0)","v":{"$error":"#N/A"}},{"$f":"MATCH(AK$3,Millwall!$Z76:$AK76,0)","v":{"$error":"#N/A"}},{"$f":"MATCH(AL$3,Millwall!$Z76:$AK76,0)","v":{"$error":"#N/A"}},{"$f":"MATCH(AM$3,Millwall!$Z76:$AK76,0)","v":{"$error":"#N/A"}},{"$f":"MATCH(AN$3,Millwall!$Z76:$AK76,0)","v":{"$error":"#N/A"}},{"$f":"MATCH(AO$3,Millwall!$Z76:$AK76,0)","v":{"$error":"#N/A"}},{"$f":"MATCH(AP$3,Millwall!$Z76:$AK76,0)","v":{"$error":"#N/A"}},{"$f":"MATCH(AQ$3,Millwall!$Z76:$AK76,0)","v":{"$error":"#N/A"}},{"$f":"MATCH(AR$3,Millwall!$Z76:$AK76,0)","v":{"$error":"#N/A"}},null,null,null,null,null,{"$f":"MATCH(AX$3,Millwall!$Z76:AK76,0)","v":{"$error":"#N/A"}},{"$f":"MATCH(AY$3,Millwall!$Z76:AK76,0)","v":{"$error":"#N/A"}},{"$f":"MATCH(AZ$3,Millwall!$Z76:AK76,0)","v":{"$error":"#N/A"}},{"$f":"MATCH(BA$3,Millwall!$Z76:AK76,0)","v":{"$error":"#N/A"}},{"$f":"MATCH(BB$3,Millwall!$Z76:AK76,0)","v":12},{"$f":"MATCH(BC$3,Millwall!$Z76:AK76,0)","v":{"$error":"#N/A"}},{"$f":"MATCH(BD$3,Millwall!$Z76:AK76,0)","v":{"$error":"#N/A"}},{"$f":"MATCH(BE$3,Millwall!$Z76:AK76,0)","v":{"$error":"#N/A"}},{"$f":"MATCH(BF$3,Millwall!$Z76:AK76,0)","v":{"$error":"#N/A"}},{"$f":"MATCH(BG$3,Millwall!$Z76:AK76,0)","v":{"$error":"#N/A"}},{"$f":"MATCH(BH$3,Millwall!$Z76:AK76,0)","v":{"$error":"#N/A"}},{"$f":"MATCH(BI$3,Millwall!$Z76:AK76,0)","v":{"$error":"#N/A"}},{"$f":"MATCH(BJ$3,Millwall!$Z76:AK76,0)","v":{"$error":"#N/A"}},{"$f":"MATCH(BK$3,Millwall!$Z76:AK76,0)","v":{"$error":"#N/A"}},{"$f":"MATCH(BL$3,Millwall!$Z76:AK76,0)","v":{"$error":"#N/A"}},{"$f":"MATCH(BM$3,Millwall!$Z76:AK76,0)","v":{"$error":"#N/A"}},{"$f":"MATCH(BN$3,Millwall!$Z76:AK76,0)","v":10},{"$f":"MATCH(BO$3,Millwall!$Z76:AK76,0)","v":{"$error":"#N/A"}},{"$f":"MATCH(BP$3,Millwall!$Z76:AK76,0)","v":{"$error":"#N/A"}},{"$f":"MATCH(BQ$3,Millwall!$Z76:AK76,0)","v":{"$error":"#N/A"}},{"$f":"MATCH(BR$3,Millwall!$Z76:AK76,0)","v":{"$error":"#N/A"}},{"$f":"MATCH(BS$3,Millwall!$Z76:AK76,0)","v":{"$error":"#N/A"}},{"$f":"MATCH(BT$3,Millwall!$Z76:AK76,0)","v":{"$error":"#N/A"}},{"$f":"MATCH(BU$3,Millwall!$Z76:AK76,0)","v":{"$error":"#N/A"}},{"$f":"MATCH(BV$3,Millwall!$Z76:AK76,0)","v":{"$error":"#N/A"}},{"$f":"MATCH(BW$3,Millwall!$Z76:AK76,0)","v":{"$error":"#N/A"}},{"$f":"MATCH(BX$3,Millwall!$Z76:AK76,0)","v":{"$error":"#N/A"}},{"$f":"MATCH(BY$3,Millwall!$Z76:AK76,0)","v":{"$error":"#N/A"}},{"$f":"MATCH(BZ$3,Millwall!$Z76:AK76,0)","v":{"$error":"#N/A"}},{"$f":"MATCH(CA$3,Millwall!$Z76:AK76,0)","v":{"$error":"#N/A"}},{"$f":"MATCH(CB$3,Millwall!$Z76:AK76,0)","v":{"$error":"#N/A"}},{"$f":"MATCH(CC$3,Millwall!$Z76:AK76,0)","v":{"$error":"#N/A"}},{"$f":"MATCH(CD$3,Millwall!$Z76:AK76,0)","v":{"$error":"#N/A"}},{"$f":"MATCH(CE$3,Millwall!$Z76:AK76,0)","v":{"$error":"#N/A"}},null,null,null,null,null,null,null,{"$f":"Millwall!$BN54","v":"Baldwin"},{"$f":"Millwall!$BN54&\" (**\"","v":"Baldwin (**"},{"$f":"Millwall!$BN54&\"**\"","v":"Baldwin**"},null,{"$f":"$CM$6","v":"Baldwin"},{"$f":"$CN$6","v":"Baldwin (**"},{"$f":"$CO$6","v":"Baldwin**"},null,{"$f":"Millwall!$BV$7","v":1}]
[null,null,0,3,null,{"$f":"Millwall!V77","v":"1974-08-24"},null,{"$f":"Millwall!W77","v":"Man Utd"},{"$f":"Millwall!X77","v":"(A)"},{"$f":"Millwall!Y77","v":"L 0-4"},{"$f":"MATCH(K$4,Millwall!$Z77:$AK77,0)","v":{"$error":"#N/A"}},{"$f":"MATCH(L$4,Millwall!$Z77:$AK77,0)","v":{"$error":"#N/A"}},{"$f":"MATCH(M$4,Millwall!$Z77:$AK77,0)","v":12},{"$f":"MATCH(N$4,Millwall!$Z77:$AK77,0)","v":3},{"$f":"MATCH(O$4,Millwall!$Z77:$AK77,0)","v":{"$error":"#N/A"}},{"$f":"MATCH(P$4,Millwall!$Z77:$AK77,0)","v":{"$error":"#N/A"}},{"$f":"MATCH(Q$4,Millwall!$Z77:$AK77,0)","v":9},{"$f":"MATCH(R$4,Millwall!$Z77:$AK77,0)","v":{"$error":"#N/A"}},{"$f":"MATCH(S$4,Millwall!$Z77:$AK77,0)","v":{"$error":"#N/A"}},{"$f":"MATCH(T$4,Millwall!$Z77:$AK77,0)","v":2},{"$f":"MATCH(U$4,Millwall!$Z77:$AK77,0)","v":4},{"$f":"MATCH(V$4,Millwall!$Z77:$AK77,0)","v":{"$error":"#N/A"}},{"$f":"MATCH(W$4,Millwall!$Z77:$AK77,0)","v":{"$error":"#N/A"}},{"$f":"MATCH(X$4,Millwall!$Z77:$AK77,0)","v":11},{"$f":"MATCH(Y$4,Millwall!$Z77:$AK77,0)","v":{"$error":"#N/A"}},{"$f":"MATCH(Z$4,Millwall!$Z77:$AK77,0)","v":{"$error":"#N/A"}},{"$f":"MATCH(AA$4,Millwall!$Z77:$AK77,0)","v":10},{"$f":"MATCH(AB$4,Millwall!$Z77:$AK77,0)","v":1},{"$f":"MATCH(AC$4,Millwall!$Z77:$AK77,0)","v":5},{"$f":"MATCH(AD$4,Millwall!$Z77:$AK77,0)","v":{"$error":"#N/A"}},{"$f":"MATCH(AE$4,Millwall!$Z77:$AK77,0)","v":6},{"$f":"MATCH(AF$4,Millwall!$Z77:$AK77,0)","v":7},{"$f":"MATCH(AG$4,Millwall!$Z77:$AK77,0)","v":{"$error":"#N/A"}},{"$f":"MATCH(AH$3,Millwall!$Z77:$AK77,0)","v":{"$error":"#N/A"}},{"$f":"MATCH(AI$3,Millwall!$Z77:$AK77,0)","v":8},{"$f":"MATCH(AJ$3,Millwall!$Z77:$AK77,0)","v":{"$error":"#N/A"}},{"$f":"MATCH(AK$3,Millwall!$Z77:$AK77,0)","v":{"$error":"#N/A"}},{"$f":"MATCH(AL$3,Millwall!$Z77:$AK77,0)","v":{"$error":"#N/A"}},{"$f":"MATCH(AM$3,Millwall!$Z77:$AK77,0)","v":{"$error":"#N/A"}},{"$f":"MATCH(AN$3,Millwall!$Z77:$AK77,0)","v":{"$error":"#N/A"}},{"$f":"MATCH(AO$3,Millwall!$Z77:$AK77,0)","v":{"$error":"#N/A"}},{"$f":"MATCH(AP$3,Millwall!$Z77:$AK77,0)","v":{"$error":"#N/A"}},{"$f":"MATCH(AQ$3,Millwall!$Z77:$AK77,0)","v":{"$error":"#N/A"}},{"$f":"MATCH(AR$3,Millwall!$Z77:$AK77,0)","v":{"$error":"#N/A"}},null,null,null,null,null,{"$f":"MATCH(AX$3,Millwall!$Z77:AK77,0)","v":{"$error":"#N/A"}},{"$f":"MATCH(AY$3,Millwall!$Z77:AK77,0)","v":{"$error":"#N/A"}},{"$f":"MATCH(AZ$3,Millwall!$Z77:AK77,0)","v":12},{"$f":"MATCH(BA$3,Millwall!$Z77:AK77,0)","v":{"$error":"#N/A"}},{"$f":"MATCH(BB$3,Millwall!$Z77:AK77,0)","v":{"$error":"#N/A"}},{"$f":"MATCH(BC$3,Millwall!$Z77:AK77,0)","v":{"$error":"#N/A"}},{"$f":"MATCH(BD$3,Millwall!$Z77:AK77,0)","v":9},{"$f":"MATCH(BE$3,Millwall!$Z77:AK77,0)","v":{"$error":"#N/A"}},{"$f":"MATCH(BF$3,Millwall!$Z77:AK77,0)","v":{"$error":"#N/A"}},{"$f":"MATCH(BG$3,Millwall!$Z77:AK77,0)","v":{"$error":"#N/A"}},{"$f":"MATCH(BH$3,Millwall!$Z77:AK77,0)","v":{"$error":"#N/A"}},{"$f":"MATCH(BI$3,Millwall!$Z77:AK77,0)","v":{"$error":"#N/A"}},{"$f":"MATCH(BJ$3,Millwall!$Z77:AK77,0)","v":{"$error":"#N/A"}},{"$f":"MATCH(BK$3,Millwall!$Z77:AK77,0)","v":{"$error":"#N/A"}},{"$f":"MATCH(BL$3,Millwall!$Z77:AK77,0)","v":{"$error":"#N/A"}},{"$f":"MATCH(BM$3,Millwall!$Z77:AK77,0)","v":{"$error":"#N/A"}},{"$f":"MATCH(BN$3,Millwall!$Z77:AK77,0)","v":{"$error":"#N/A"}},{"$f":"MATCH(BO$3,Millwall!$Z77:AK77,0)","v":{"$error":"#N/A"}},{"$f":"MATCH(BP$3,Millwall!$Z77:AK77,0)","v":{"$error":"#N/A"}},{"$f":"MATCH(BQ$3,Millwall!$Z77:AK77,0)","v":{"$error":"#N/A"}},{"$f":"MATCH(BR$3,Millwall!$Z77:AK77,0)","v":{"$error":"#N/A"}},{"$f":"MATCH(BS$3,Millwall!$Z77:AK77,0)","v":{"$error":"#N/A"}},{"$f":"MATCH(BT$3,Millwall!$Z77:AK77,0)","v":{"$error":"#N/A"}},{"$f":"MATCH(BU$3,Millwall!$Z77:AK77,0)","v":{"$error":"#N/A"}},{"$f":"MATCH(BV$3,Millwall!$Z77:AK77,0)","v":{"$error":"#N/A"}},{"$f":"MATCH(BW$3,Millwall!$Z77:AK77,0)","v":{"$error":"#N/A"}},{"$f":"MATCH(BX$3,Millwall!$Z77:AK77,0)","v":{"$error":"#N/A"}},{"$f":"MATCH(BY$3,Millwall!$Z77:AK77,0)","v":{"$error":"#N/A"}},{"$f":"MATCH(BZ$3,Millwall!$Z77:AK77,0)","v":{"$error":"#N/A"}},{"$f":"MATCH(CA$3,Millwall!$Z77:AK77,0)","v":{"$error":"#N/A"}},{"$f":"MATCH(CB$3,Millwall!$Z77:AK77,0)","v":{"$error":"#N/A"}},{"$f":"MATCH(CC$3,Millwall!$Z77:AK77,0)","v":{"$error":"#N/A"}},{"$f":"MATCH(CD$3,Millwall!$Z77:AK77,0)","v":{"$error":"#N/A"}},{"$f":"MATCH(CE$3,Millwall!$Z77:AK77,0)","v":{"$error":"#N/A"}},null,null,null,null,null,null,null,{"$f":"Millwall!$BN55","v":"Bolland"},{"$f":"Millwall!$BN55&\" (**\"","v":"Bolland (**"},{"$f":"Millwall!$BN55&\"**\"","v":"Bolland**"},null,{"$f":"$CM$7","v":"Bolland"},{"$f":"$CN$7","v":"Bolland (**"},{"$f":"$CO$7","v":"Bolland**"},null,{"$f":"Millwall!$BV$8","v":5}]
[null,null,0,4,null,{"$f":"Millwall!V78","v":"1974-08-27"},null,{"$f":"Millwall!W78","v":"Nottm Forest"},{"$f":"Millwall!X78","v":"(A)"},{"$f":"Millwall!Y78","v":"L 1-2"},{"$f":"MATCH(K$4,Millwall!$Z78:$AK78,0)","v":{"$error":"#N/A"}},{"$f":"MATCH(L$4,Millwall!$Z78:$AK78,0)","v":{"$error":"#N/A"}},{"$f":"MATCH(M$4,Millwall!$Z78:$AK78,0)","v":9},{"$f":"MATCH(N$4,Millwall!$Z78:$AK78,0)","v":3},{"$f":"MATCH(O$4,Millwall!$Z78:$AK78,0)","v":{"$error":"#N/A"}},{"$f":"MATCH(P$4,Millwall!$Z78:$AK78,0)","v":{"$error":"#N/A"}},{"$f":"MATCH(Q$4,Millwall!$Z78:$AK78,0)","v":{"$error":"#N/A"}},{"$f":"MATCH(R$4,Millwall!$Z78:$AK78,0)","v":{"$error":"#N/A"}},{"$f":"MATCH(S$4,Millwall!$Z78:$AK78,0)","v":{"$error":"#N/A"}},{"$f":"MATCH(T$4,Millwall!$Z78:$AK78,0)","v":2},{"$f":"MATCH(U$4,Millwall!$Z78:$AK78,0)","v":4},{"$f":"MATCH(V$4,Millwall!$Z78:$AK78,0)","v":{"$error":"#N/A"}},{"$f":"MATCH(W$4,Millwall!$Z78:$AK78,0)","v":{"$error":"#N/A"}},{"$f":"MATCH(X$4,Millwall!$Z78:$AK78,0)","v":11},{"$f":"MATCH(Y$4,Millwall!$Z78:$AK78,0)","v":{"$error":"#N/A"}},{"$f":"MATCH(Z$4,Millwall!$Z78:$AK78,0)","v":{"$error":"#N/A"}},{"$f":"MATCH(AA$4,Millwall!$Z78:$AK78,0)","v":10},{"$f":"MATCH(AB$4,Millwall!$Z78:$AK78,0)","v":1},{"$f":"MATCH(AC$4,Millwall!$Z78:$AK78,0)","v":5},{"$f":"MATCH(AD$4,Millwall!$Z78:$AK78,0)","v":{"$error":"#N/A"}},{"$f":"MATCH(AE$4,Millwall!$Z78:$AK78,0)","v":6},{"$f":"MATCH(AF$4,Millwall!$Z78:$AK78,0)","v":7},{"$f":"MATCH(AG$4,Millwall!$Z78:$AK78,0)","v":{"$error":"#N/A"}},{"$f":"MATCH(AH$3,Millwall!$Z78:$AK78,0)","v":{"$error":"#N/A"}},{"$f":"MATCH(AI$3,Millwall!$Z78:$AK78,0)","v":8},{"$f":"MATCH(AJ$3,Millwall!$Z78:$AK78,0)","v":{"$error":"#N/A"}},{"$f":"MATCH(AK$3,Millwall!$Z78:$AK78,0)","v":{"$error":"#N/A"}},{"$f":"MATCH(AL$3,Millwall!$Z78:$AK78,0)","v":{"$error":"#N/A"}},{"$f":"MATCH(AM$3,Millwall!$Z78:$AK78,0)","v":{"$error":"#N/A"}},{"$f":"MATCH(AN$3,Millwall!$Z78:$AK78,0)","v":{"$error":"#N/A"}},{"$f":"MATCH(AO$3,Millwall!$Z78:$AK78,0)","v":{"$error":"#N/A"}},{"$f":"MATCH(AP$3,Millwall!$Z78:$AK78,0)","v":{"$error":"#N/A"}},{"$f":"MATCH(AQ$3,Millwall!$Z78:$AK78,0)","v":{"$error":"#N/A"}},{"$f":"MATCH(AR$3,Millwall!$Z78:$AK78,0)","v":{"$error":"#N/A"}},null,null,null,null,null,{"$f":"MATCH(AX$3,Millwall!$Z78:AK78,0)","v":{"$error":"#N/A"}},{"$f":"MATCH(AY$3,Millwall!$Z78:AK78,0)","v":{"$error":"#N/A"}},{"$f":"MATCH(AZ$3,Millwall!$Z78:AK78,0)","v":{"$error":"#N/A"}},{"$f":"MATCH(BA$3,Millwall!$Z78:AK78,0)","v":{"$error":"#N/A"}},{"$f":"MATCH(BB$3,Millwall!$Z78:AK78,0)","v":{"$error":"#N/A"}},{"$f":"MATCH(BC$3,Millwall!$Z78:AK78,0)","v":{"$error":"#N/A"}},{"$f":"MATCH(BD$3,Millwall!$Z78:AK78,0)","v":{"$error":"#N/A"}},{"$f":"MATCH(BE$3,Millwall!$Z78:AK78,0)","v":{"$error":"#N/A"}},{"$f":"MATCH(BF$3,Millwall!$Z78:AK78,0)","v":{"$error":"#N/A"}},{"$f":"MATCH(BG$3,Millwall!$Z78:AK78,0)","v":{"$error":"#N/A"}},{"$f":"MATCH(BH$3,Millwall!$Z78:AK78,0)","v":{"$error":"#N/A"}},{"$f":"MATCH(BI$3,Millwall!$Z78:AK78,0)","v":{"$error":"#N/A"}},{"$f":"MATCH(BJ$3,Millwall!$Z78:AK78,0)","v":{"$error":"#N/A"}},{"$f":"MATCH(BK$3,Millwall!$Z78:AK78,0)","v":{"$error":"#N/A"}},{"$f":"MATCH(BL$3,Millwall!$Z78:AK78,0)","v":{"$error":"#N/A"}},{"$f":"MATCH(BM$3,Millwall!$Z78:AK78,0)","v":{"$error":"#N/A"}},{"$f":"MATCH(BN$3,Millwall!$Z78:AK78,0)","v":{"$error":"#N/A"}},{"$f":"MATCH(BO$3,Millwall!$Z78:AK78,0)","v":{"$error":"#N/A"}},{"$f":"MATCH(BP$3,Millwall!$Z78:AK78,0)","v":{"$error":"#N/A"}},{"$f":"MATCH(BQ$3,Millwall!$Z78:AK78,0)","v":{"$error":"#N/A"}},{"$f":"MATCH(BR$3,Millwall!$Z78:AK78,0)","v":{"$error":"#N/A"}},{"$f":"MATCH(BS$3,Millwall!$Z78:AK78,0)","v":{"$error":"#N/A"}},{"$f":"MATCH(BT$3,Millwall!$Z78:AK78,0)","v":{"$error":"#N/A"}},{"$f":"MATCH(BU$3,Millwall!$Z78:AK78,0)","v":{"$error":"#N/A"}},{"$f":"MATCH(BV$3,Millwall!$Z78:AK78,0)","v":{"$error":"#N/A"}},{"$f":"MATCH(BW$3,Millwall!$Z78:AK78,0)","v":{"$error":"#N/A"}},{"$f":"MATCH(BX$3,Millwall!$Z78:AK78,0)","v":{"$error":"#N/A"}},{"$f":"MATCH(BY$3,Millwall!$Z78:AK78,0)","v":{"$error":"#N/A"}},{"$f":"MATCH(BZ$3,Millwall!$Z78:AK78,0)","v":{"$error":"#N/A"}},{"$f":"MATCH(CA$3,Millwall!$Z78:AK78,0)","v":{"$error":"#N/A"}},{"$f":"MATCH(CB$3,Millwall!$Z78:AK78,0)","v":{"$error":"#N/A"}},{"$f":"MATCH(CC$3,Millwall!$Z78:AK78,0)","v":{"$error":"#N/A"}},{"$f":"MATCH(CD$3,Millwall!$Z78:AK78,0)","v":{"$error":"#N/A"}},{"$f":"MATCH(CE$3,Millwall!$Z78:AK78,0)","v":{"$error":"#N/A"}},null,null,null,null,null,null,null,{"$f":"Millwall!$BN56","v":"B Brown"},{"$f":"Millwall!$BN56&\" (**\"","v":"B Brown (**"},{"$f":"Millwall!$BN56&\"**\"","v":"B Brown**"},null,{"$f":"$CM$8","v":"B Brown"},{"$f":"$CN$8","v":"B Brown (**"},{"$f":"$CO$8","v":"B Brown**"},null,{"$f":"Millwall!$BV$9","v":0}]
[null,null,0,5,null,{"$f":"Millwall!V79","v":"1974-08-31"},null,{"$f":"Millwall!W79","v":"Fulham"},{"$f":"Millwall!X79","v":"(H)"},{"$f":"Millwall!Y79","v":"W 2-0"},{"$f":"MATCH(K$4,Millwall!$Z79:$AK79,0)","v":{"$error":"#N/A"}},{"$f":"MATCH(L$4,Millwall!$Z79:$AK79,0)","v":{"$error":"#N/A"}},{"$f":"MATCH(M$4,Millwall!$Z79:$AK79,0)","v":10},{"$f":"MATCH(N$4,Millwall!$Z79:$AK79,0)","v":{"$error":"#N/A"}},{"$f":"MATCH(O$4,Millwall!$Z79:$AK79,0)","v":{"$error":"#N/A"}},{"$f":"MATCH(P$4,Millwall!$Z79:$AK79,0)","v":{"$error":"#N/A"}},{"$f":"MATCH(Q$4,Millwall!$Z79:$AK79,0)","v":{"$error":"#N/A"}},{"$f":"MATCH(R$4,Millwall!$Z79:$AK79,0)","v":{"$error":"#N/A"}},{"$f":"MATCH(S$4,Millwall!$Z79:$AK79,0)","v":{"$error":"#N/A"}},{"$f":"MATCH(T$4,Millwall!$Z79:$AK79,0)","v":2},{"$f":"MATCH(U$4,Millwall!$Z79:$AK79,0)","v":4},{"$f":"MATCH(V$4,Millwall!$Z79:$AK79,0)","v":{"$error":"#N/A"}},{"$f":"MATCH(W$4,Millwall!$Z79:$AK79,0)","v":{"$error":"#N/A"}},{"$f":"MATCH(X$4,Millwall!$Z79:$AK79,0)","v":11},{"$f":"MATCH(Y$4,Millwall!$Z79:$AK79,0)","v":3},{"$f":"MATCH(Z$4,Millwall!$Z79:$AK79,0)","v":{"$error":"#N/A"}},{"$f":"MATCH(AA$4,Millwall!$Z79:$AK79,0)","v":8},{"$f":"MATCH(AB$4,Millwall!$Z79:$AK79,0)","v":1},{"$f":"MATCH(AC$4,Millwall!$Z79:$AK79,0)","v":5},{"$f":"MATCH(AD$4,Millwall!$Z79:$AK79,0)","v":{"$error":"#N/A"}},{"$f":"MATCH(AE$4,Millwall!$Z79:$AK79,0)","v":6},{"$f":"MATCH(AF$4,Millwall!$Z79:$AK79,0)","v":7},{"$f":"MATCH(AG$4,Millwall!$Z79:$AK79,0)","v":{"$error":"#N/A"}},{"$f":"MATCH(AH$3,Millwall!$Z79:$AK79,0)","v":{"$error":"#N/A"}},{"$f":"MATCH(AI$3,Millwall!$Z79:$AK79,0)","v":9},{"$f":"MATCH(AJ$3,Millwall!$Z79:$AK79,0)","v":{"$error":"#N/A"}},{"$f":"MATCH(AK$3,Millwall!$Z79:$AK79,0)","v":{"$error":"#N/A"}},{"$f":"MATCH(AL$3,Millwall!$Z79:$AK79,0)","v":{"$error":"#N/A"}},{"$f":"MATCH(AM$3,Millwall!$Z79:$AK79,0)","v":{"$error":"#N/A"}},{"$f":"MATCH(AN$3,Millwall!$Z79:$AK79,0)","v":{"$error":"#N/A"}},{"$f":"MATCH(AO$3,Millwall!$Z79:$AK79,0)","v":{"$error":"#N/A"}},{"$f":"MATCH(AP$3,Millwall!$Z79:$AK79,0)","v":{"$error":"#N/A"}},{"$f":"MATCH(AQ$3,Millwall!$Z79:$AK79,0)","v":{"$error":"#N/A"}},{"$f":"MATCH(AR$3,Millwall!$Z79:$AK79,0)","v":{"$error":"#N/A"}},null,null,null,null,null,{"$f":"MATCH(AX$3,Millwall!$Z79:AK79,0)","v":{"$error":"#N/A"}},{"$f":"MATCH(AY$3,Millwall!$Z79:AK79,0)","v":{"$error":"#N/A"}},{"$f":"MATCH(AZ$3,Millwall!$Z79:AK79,0)","v":{"$error":"#N/A"}},{"$f":"MATCH(BA$3,Millwall!$Z79:AK79,0)","v":{"$error":"#N/A"}},{"$f":"MATCH(BB$3,Millwall!$Z79:AK79,0)","v":{"$error":"#N/A"}},{"$f":"MATCH(BC$3,Millwall!$Z79:AK79,0)","v":{"$error":"#N/A"}},{"$f":"MATCH(BD$3,Millwall!$Z79:AK79,0)","v":{"$error":"#N/A"}},{"$f":"MATCH(BE$3,Millwall!$Z79:AK79,0)","v":{"$error":"#N/A"}},{"$f":"MATCH(BF$3,Millwall!$Z79:AK79,0)","v":{"$error":"#N/A"}},{"$f":"MATCH(BG$3,Millwall!$Z79:AK79,0)","v":{"$error":"#N/A"}},{"$f":"MATCH(BH$3,Millwall!$Z79:AK79,0)","v":{"$error":"#N/A"}},{"$f":"MATCH(BI$3,Millwall!$Z79:AK79,0)","v":{"$error":"#N/A"}},{"$f":"MATCH(BJ$3,Millwall!$Z79:AK79,0)","v":{"$error":"#N/A"}},{"$f":"MATCH(BK$3,Millwall!$Z79:AK79,0)","v":{"$error":"#N/A"}},{"$f":"MATCH(BL$3,Millwall!$Z79:AK79,0)","v":{"$error":"#N/A"}},{"$f":"MATCH(BM$3,Millwall!$Z79:AK79,0)","v":{"$error":"#N/A"}},{"$f":"MATCH(BN$3,Millwall!$Z79:AK79,0)","v":{"$error":"#N/A"}},{"$f":"MATCH(BO$3,Millwall!$Z79:AK79,0)","v":{"$error":"#N/A"}},{"$f":"MATCH(BP$3,Millwall!$Z79:AK79,0)","v":{"$error":"#N/A"}},{"$f":"MATCH(BQ$3,Millwall!$Z79:AK79,0)","v":{"$error":"#N/A"}},{"$f":"MATCH(BR$3,Millwall!$Z79:AK79,0)","v":{"$error":"#N/A"}},{"$f":"MATCH(BS$3,Millwall!$Z79:AK79,0)","v":{"$error":"#N/A"}},{"$f":"MATCH(BT$3,Millwall!$Z79:AK79,0)","v":{"$error":"#N/A"}},{"$f":"MATCH(BU$3,Millwall!$Z79:AK79,0)","v":{"$error":"#N/A"}},{"$f":"MATCH(BV$3,Millwall!$Z79:AK79,0)","v":{"$error":"#N/A"}},{"$f":"MATCH(BW$3,Millwall!$Z79:AK79,0)","v":{"$error":"#N/A"}},{"$f":"MATCH(BX$3,Millwall!$Z79:AK79,0)","v":{"$error":"#N/A"}},{"$f":"MATCH(BY$3,Millwall!$Z79:AK79,0)","v":{"$error":"#N/A"}},{"$f":"MATCH(BZ$3,Millwall!$Z79:AK79,0)","v":{"$error":"#N/A"}},{"$f":"MATCH(CA$3,Millwall!$Z79:AK79,0)","v":{"$error":"#N/A"}},{"$f":"MATCH(CB$3,Millwall!$Z79:AK79,0)","v":{"$error":"#N/A"}},{"$f":"MATCH(CC$3,Millwall!$Z79:AK79,0)","v":{"$error":"#N/A"}},{"$f":"MATCH(CD$3,Millwall!$Z79:AK79,0)","v":{"$error":"#N/A"}},{"$f":"MATCH(CE$3,Millwall!$Z79:AK79,0)","v":{"$error":"#N/A"}},null,null,null,null,null,null,null,{"$f":"Millwall!$BN57","v":"S Brown"},{"$f":"Millwall!$BN57&\" (**\"","v":"S Brown (**"},{"$f":"Millwall!$BN57&\"**\"","v":"S Brown**"},null,{"$f":"$CM$9","v":"S Brown"},{"$f":"$CN$9","v":"S Brown (**"},{"$f":"$CO$9","v":"S Brown**"},null,{"$f":"Millwall!$BV$10","v":1}]
[null,null,0,6,null,{"$f":"Millwall!V80","v":"1974-09-07"},null,{"$f":"Millwall!W80","v":"Blackpool"},{"$f":"Millwall!X80","v":"(A)"},{"$f":"Millwall!Y80","v":"L 0-1"},{"$f":"MATCH(K$4,Millwall!$Z80:$AK80,0)","v":12},{"$f":"MATCH(L$4,Millwall!$Z80:$AK80,0)","v":{"$error":"#N/A"}},{"$f":"MATCH(M$4,Millwall!$Z80:$AK80,0)","v":8},{"$f":"MATCH(N$4,Millwall!$Z80:$AK80,0)","v":{"$error":"#N/A"}},{"$f":"MATCH(O$4,Millwall!$Z80:$AK80,0)","v":{"$error":"#N/A"}},{"$f":"MATCH(P$4,Millwall!$Z80:$AK80,0)","v":{"$error":"#N/A"}},{"$f":"MATCH(Q$4,Millwall!$Z80:$AK80,0)","v":{"$error":"#N/A"}},{"$f":"MATCH(R$4,Millwall!$Z80:$AK80,0)","v":{"$error":"#N/A"}},{"$f":"MATCH(S$4,Millwall!$Z80:$AK80,0)","v":{"$error":"#N/A"}},{"$f":"MATCH(T$4,Millwall!$Z80:$AK80,0)","v":2},{"$f":"MATCH(U$4,Millwall!$Z80:$AK80,0)","v":4},{"$f":"MATCH(V$4,Millwall!$Z80:$AK80,0)","v":{"$error":"#N/A"}},{"$f":"MATCH(W$4,Millwall!$Z80:$AK80,0)","v":{"$error":"#N/A"}},{"$f":"MATCH(X$4,Millwall!$Z80:$AK80,0)","v":11},{"$f":"MATCH(Y$4,Millwall!$Z80:$AK80,0)","v":3},{"$f":"MATCH(Z$4,Millwall!$Z80:$AK80,0)","v":{"$error":"#N/A"}},{"$f":"MATCH(AA$4,Millwall!$Z80:$AK80,0)","v":10},{"$f":"MATCH(AB$4,Millwall!$Z80:$AK80,0)","v":1},{"$f":"MATCH(AC$4,Millwall!$Z80:$AK80,0)","v":5},{"$f":"MATCH(AD$4,Millwall!$Z80:$AK80,0)","v":{"$error":"#N/A"}},{"$f":"MATCH(AE$4,Millwall!$Z80:$AK80,0)","v":6},{"$f":"MATCH(AF$4,Millwall!$Z80:$AK80,0)","v":7},{"$f":"MATCH(AG$4,Millwall!$Z80:$AK80,0)","v":{"$error":"#N/A"}},{"$f":"MATCH(AH$3,Millwall!$Z80:$AK80,0)","v":{"$error":"#N/A"}},{"$f":"MATCH(AI$3,Millwall!$Z80:$AK80,0)","v":9},{"$f":"MATCH(AJ$3,Millwall!$Z80:$AK80,0)","v":{"$error":"#N/A"}},{"$f":"MATCH(AK$3,Millwall!$Z80:$AK80,0)","v":{"$error":"#N/A"}},{"$f":"MATCH(AL$3,Millwall!$Z80:$AK80,0)","v":{"$error":"#N/A"}},{"$f":"MATCH(AM$3,Millwall!$Z80:$AK80,0)","v":{"$error":"#N/A"}},{"$f":"MATCH(AN$3,Millwall!$Z80:$AK80,0)","v":{"$error":"#N/A"}},{"$f":"MATCH(AO$3,Millwall!$Z80:$AK80,0)","v":{"$error":"#N/A"}},{"$f":"MATCH(AP$3,Millwall!$Z80:$AK80,0)","v":{"$error":"#N/A"}},{"$f":"MATCH(AQ$3,Millwall!$Z80:$AK80,0)","v":{"$error":"#N/A"}},{"$f":"MATCH(AR$3,Millwall!$Z80:$AK80,0)","v":{"$error":"#N/A"}},null,null,null,null,null,{"$f":"MATCH(AX$3,Millwall!$Z80:AK80,0)","v":12},{"$f":"MATCH(AY$3,Millwall!$Z80:AK80,0)","v":{"$error":"#N/A"}},{"$f":"MATCH(AZ$3,Millwall!$Z80:AK80,0)","v":{"$error":"#N/A"}},{"$f":"MATCH(BA$3,Millwall!$Z80:AK80,0)","v":{"$error":"#N/A"}},{"$f":"MATCH(BB$3,Millwall!$Z80:AK80,0)","v":{"$error":"#N/A"}},{"$f":"MATCH(BC$3,Millwall!$Z80:AK80,0)","v":{"$error":"#N/A"}},{"$f":"MATCH(BD$3,Millwall!$Z80:AK80,0)","v":{"$error":"#N/A"}},{"$f":"MATCH(BE$3,Millwall!$Z80:AK80,0)","v":{"$error":"#N/A"}},{"$f":"MATCH(BF$3,Millwall!$Z80:AK80,0)","v":{"$error":"#N/A"}},{"$f":"MATCH(BG$3,Millwall!$Z80:AK80,0)","v":{"$error":"#N/A"}},{"$f":"MATCH(BH$3,Millwall!$Z80:AK80,0)","v":{"$error":"#N/A"}},{"$f":"MATCH(BI$3,Millwall!$Z80:AK80,0)","v":{"$error":"#N/A"}},{"$f":"MATCH(BJ$3,Millwall!$Z80:AK80,0)","v":{"$error":"#N/A"}},{"$f":"MATCH(BK$3,Millwall!$Z80:AK80,0)","v":11},{"$f":"MATCH(BL$3,Millwall!$Z80:AK80,0)","v":{"$error":"#N/A"}},{"$f":"MATCH(BM$3,Millwall!$Z80:AK80,0)","v":{"$error":"#N/A"}},{"$f":"MATCH(BN$3,Millwall!$Z80:AK80,0)","v":{"$error":"#N/A"}},{"$f":"MATCH(BO$3,Millwall!$Z80:AK80,0)","v":{"$error":"#N/A"}},{"$f":"MATCH(BP$3,Millwall!$Z80:AK80,0)","v":{"$error":"#N/A"}},{"$f":"MATCH(BQ$3,Millwall!$Z80:AK80,0)","v":{"$error":"#N/A"}},{"$f":"MATCH(BR$3,Millwall!$Z80:AK80,0)","v":{"$error":"#N/A"}},{"$f":"MATCH(BS$3,Millwall!$Z80:AK80,0)","v":{"$error":"#N/A"}},{"$f":"MATCH(BT$3,Millwall!$Z80:AK80,0)","v":{"$error":"#N/A"}},{"$f":"MATCH(BU$3,Millwall!$Z80:AK80,0)","v":{"$error":"#N/A"}},{"$f":"MATCH(BV$3,Millwall!$Z80:AK80,0)","v":{"$error":"#N/A"}},{"$f":"MATCH(BW$3,Millwall!$Z80:AK80,0)","v":{"$error":"#N/A"}},{"$f":"MATCH(BX$3,Millwall!$Z80:AK80,0)","v":{"$error":"#N/A"}},{"$f":"MATCH(BY$3,Millwall!$Z80:AK80,0)","v":{"$error":"#N/A"}},{"$f":"MATCH(BZ$3,Millwall!$Z80:AK80,0)","v":{"$error":"#N/A"}},{"$f":"MATCH(CA$3,Millwall!$Z80:AK80,0)","v":{"$error":"#N/A"}},{"$f":"MATCH(CB$3,Millwall!$Z80:AK80,0)","v":{"$error":"#N/A"}},{"$f":"MATCH(CC$3,Millwall!$Z80:AK80,0)","v":{"$error":"#N/A"}},{"$f":"MATCH(CD$3,Millwall!$Z80:AK80,0)","v":{"$error":"#N/A"}},{"$f":"MATCH(CE$3,Millwall!$Z80:AK80,0)","v":{"$error":"#N/A"}},null,null,null,null,null,null,null,{"$f":"Millwall!$BN58","v":"Burnett"},{"$f":"Millwall!$BN58&\" (**\"","v":"Burnett (**"},{"$f":"Millwall!$BN58&\"**\"","v":"Burnett**"},null,{"$f":"$CM$10","v":"Burnett"},{"$f":"$CN$10","v":"Burnett (**"},{"$f":"$CO$10","v":"Burnett**"},null,{"$f":"Millwall!$BV$11","v":2}]
[null,null,0,7,null,{"$f":"Millwall!V81","v":"1974-09-14"},null,{"$f":"Millwall!W81","v":"Oxford"},{"$f":"Millwall!X81","v":"(H)"},{"$f":"Millwall!Y81","v":"D 0-0"},{"$f":"MATCH(K$4,Millwall!$Z81:$AK81,0)","v":{"$error":"#N/A"}},{"$f":"MATCH(L$4,Millwall!$Z81:$AK81,0)","v":{"$error":"#N/A"}},{"$f":"MATCH(M$4,Millwall!$Z81:$AK81,0)","v":8},{"$f":"MATCH(N$4,Millwall!$Z81:$AK81,0)","v":{"$error":"#N/A"}},{"$f":"MATCH(O$4,Millwall!$Z81:$AK81,0)","v":{"$error":"#N/A"}},{"$f":"MATCH(P$4,Millwall!$Z81:$AK81,0)","v":{"$error":"#N/A"}},{"$f":"MATCH(Q$4,Millwall!$Z81:$AK81,0)","v":12},{"$f":"MATCH(R$4,Millwall!$Z81:$AK81,0)","v":{"$error":"#N/A"}},{"$f":"MATCH(S$4,Millwall!$Z81:$AK81,0)","v":{"$error":"#N/A"}},{"$f":"MATCH(T$4,Millwall!$Z81:$AK81,0)","v":2},{"$f":"MATCH(U$4,Millwall!$Z81:$AK81,0)","v":4},{"$f":"MATCH(V$4,Millwall!$Z81:$AK81,0)","v":{"$error":"#N/A"}},{"$f":"MATCH(W$4,Millwall!$Z81:$AK81,0)","v":{"$error":"#N/A"}},{"$f":"MATCH(X$4,Millwall!$Z81:$AK81,0)","v":11},{"$f":"MATCH(Y$4,Millwall!$Z81:$AK81,0)","v":3},{"$f":"MATCH(Z$4,Millwall!$Z81:$AK81,0)","v":{"$error":"#N/A"}},{"$f":"MATCH(AA$4,Millwall!$Z81:$AK81,0)","v":10},{"$f":"MATCH(AB$4,Millwall!$Z81:$AK81,0)","v":1},{"$f":"MATCH(AC$4,Millwall!$Z81:$AK81,0)","v":5},{"$f":"MATCH(AD$4,Millwall!$Z81:$AK81,0)","v":{"$error":"#N/A"}},{"$f":"MATCH(AE$4,Millwall!$Z81:$AK81,0)","v":6},{"$f":"MATCH(AF$4,Millwall!$Z81:$AK81,0)","v":7},{"$f":"MATCH(AG$4,Millwall!$Z81:$AK81,0)","v":{"$error":"#N/A"}},{"$f":"MATCH(AH$3,Millwall!$Z81:$AK81,0)","v":{"$error":"#N/A"}},{"$f":"MATCH(AI$3,Millwall!$Z81:$AK81,0)","v":9},{"$f":"MATCH(AJ$3,Millwall!$Z81:$AK81,0)","v":{"$error":"#N/A"}},{"$f":"MATCH(AK$3,Millwall!$Z81:$AK81,0)","v":{"$error":"#N/A"}},{"$f":"MATCH(AL$3,Millwall!$Z81:$AK81,0)","v":{"$error":"#N/A"}},{"$f":"MATCH(AM$3,Millwall!$Z81:$AK81,0)","v":{"$error":"#N/A"}},{"$f":"MATCH(AN$3,Millwall!$Z81:$AK81,0)","v":{"$error":"#N/A"}},{"$f":"MATCH(AO$3,Millwall!$Z81:$AK81,0)","v":{"$error":"#N/A"}},{"$f":"MATCH(AP$3,Millwall!$Z81:$AK81,0)","v":{"$error":"#N/A"}},{"$f":"MATCH(AQ$3,Millwall!$Z81:$AK81,0)","v":{"$error":"#N/A"}},{"$f":"MATCH(AR$3,Millwall!$Z81:$AK81,0)","v":{"$error":"#N/A"}},null,null,null,null,null,{"$f":"MATCH(AX$3,Millwall!$Z81:AK81,0)","v":{"$error":"#N/A"}},{"$f":"MATCH(AY$3,Millwall!$Z81:AK81,0)","v":{"$error":"#N/A"}},{"$f":"MATCH(AZ$3,Millwall!$Z81:AK81,0)","v":{"$error":"#N/A"}},{"$f":"MATCH(BA$3,Millwall!$Z81:AK81,0)","v":{"$error":"#N/A"}},{"$f":"MATCH(BB$3,Millwall!$Z81:AK81,0)","v":{"$error":"#N/A"}},{"$f":"MATCH(BC$3,Millwall!$Z81:AK81,0)","v":{"$error":"#N/A"}},{"$f":"MATCH(BD$3,Millwall!$Z81:AK81,0)","v":12},{"$f":"MATCH(BE$3,Millwall!$Z81:AK81,0)","v":{"$error":"#N/A"}},{"$f":"MATCH(BF$3,Millwall!$Z81:AK81,0)","v":{"$error":"#N/A"}},{"$f":"MATCH(BG$3,Millwall!$Z81:AK81,0)","v":{"$error":"#N/A"}},{"$f":"MATCH(BH$3,Millwall!$Z81:AK81,0)","v":{"$error":"#N/A"}},{"$f":"MATCH(BI$3,Millwall!$Z81:AK81,0)","v":{"$error":"#N/A"}},{"$f":"MATCH(BJ$3,Millwall!$Z81:AK81,0)","v":{"$error":"#N/A"}},{"$f":"MATCH(BK$3,Millwall!$Z81:AK81,0)","v":{"$error":"#N/A"}},{"$f":"MATCH(BL$3,Millwall!$Z81:AK81,0)","v":{"$error":"#N/A"}},{"$f":"MATCH(BM$3,Millwall!$Z81:AK81,0)","v":{"$error":"#N/A"}},{"$f":"MATCH(BN$3,Millwall!$Z81:AK81,0)","v":10},{"$f":"MATCH(BO$3,Millwall!$Z81:AK81,0)","v":{"$error":"#N/A"}},{"$f":"MATCH(BP$3,Millwall!$Z81:AK81,0)","v":{"$error":"#N/A"}},{"$f":"MATCH(BQ$3,Millwall!$Z81:AK81,0)","v":{"$error":"#N/A"}},{"$f":"MATCH(BR$3,Millwall!$Z81:AK81,0)","v":{"$error":"#N/A"}},{"$f":"MATCH(BS$3,Millwall!$Z81:AK81,0)","v":{"$error":"#N/A"}},{"$f":"MATCH(BT$3,Millwall!$Z81:AK81,0)","v":{"$error":"#N/A"}},{"$f":"MATCH(BU$3,Millwall!$Z81:AK81,0)","v":{"$error":"#N/A"}},{"$f":"MATCH(BV$3,Millwall!$Z81:AK81,0)","v":{"$error":"#N/A"}},{"$f":"MATCH(BW$3,Millwall!$Z81:AK81,0)","v":{"$error":"#N/A"}},{"$f":"MATCH(BX$3,Millwall!$Z81:AK81,0)","v":{"$error":"#N/A"}},{"$f":"MATCH(BY$3,Millwall!$Z81:AK81,0)","v":{"$error":"#N/A"}},{"$f":"MATCH(BZ$3,Millwall!$Z81:AK81,0)","v":{"$error":"#N/A"}},{"$f":"MATCH(CA$3,Millwall!$Z81:AK81,0)","v":{"$error":"#N/A"}},{"$f":"MATCH(CB$3,Millwall!$Z81:AK81,0)","v":{"$error":"#N/A"}},{"$f":"MATCH(CC$3,Millwall!$Z81:AK81,0)","v":{"$error":"#N/A"}},{"$f":"MATCH(CD$3,Millwall!$Z81:AK81,0)","v":{"$error":"#N/A"}},{"$f":"MATCH(CE$3,Millwall!$Z81:AK81,0)","v":{"$error":"#N/A"}},null,null,null,null,null,null,null,{"$f":"Millwall!$BN59","v":"Clark"},{"$f":"Millwall!$BN59&\" (**\"","v":"Clark (**"},{"$f":"Millwall!$BN59&\"**\"","v":"Clark**"},null,{"$f":"$CM$11","v":"Clark"},{"$f":"$CN$11","v":"Clark (**"},{"$f":"$CO$11","v":"Clark**"},null,{"$f":"Millwall!$BV$12","v":6}]
[null,null,0,8,null,{"$f":"Millwall!V82","v":"1974-09-16"},null,{"$f":"Millwall!W82","v":"Man Utd"},{"$f":"Millwall!X82","v":"(H)"},{"$f":"Millwall!Y82","v":"L 0-1"},{"$f":"MATCH(K$4,Millwall!$Z82:$AK82,0)","v":10},{"$f":"MATCH(L$4,Millwall!$Z82:$AK82,0)","v":{"$error":"#N/A"}},{"$f":"MATCH(M$4,Millwall!$Z82:$AK82,0)","v":7},{"$f":"MATCH(N$4,Millwall!$Z82:$AK82,0)","v":{"$error":"#N/A"}},{"$f":"MATCH(O$4,Millwall!$Z82:$AK82,0)","v":{"$error":"#N/A"}},{"$f":"MATCH(P$4,Millwall!$Z82:$AK82,0)","v":{"$error":"#N/A"}},{"$f":"MATCH(Q$4,Millwall!$Z82:$AK82,0)","v":8},{"$f":"MATCH(R$4,Millwall!$Z82:$AK82,0)","v":{"$error":"#N/A"}},{"$f":"MATCH(S$4,Millwall!$Z82:$AK82,0)","v":{"$error":"#N/A"}},{"$f":"MATCH(T$4,Millwall!$Z82:$AK82,0)","v":2},{"$f":"MATCH(U$4,Millwall!$Z82:$AK82,0)","v":4},{"$f":"MATCH(V$4,Millwall!$Z82:$AK82,0)","v":{"$error":"#N/A"}},{"$f":"MATCH(W$4,Millwall!$Z82:$AK82,0)","v":{"$error":"#N/A"}},{"$f":"MATCH(X$4,Millwall!$Z82:$AK82,0)","v":11},{"$f":"MATCH(Y$4,Millwall!$Z82:$AK82,0)","v":3},{"$f":"MATCH(Z$4,Millwall!$Z82:$AK82,0)","v":{"$error":"#N/A"}},{"$f":"MATCH(AA$4,Millwall!$Z82:$AK82,0)","v":{"$error":"#N/A"}},{"$f":"MATCH(AB$4,Millwall!$Z82:$AK82,0)","v":1},{"$f":"MATCH(AC$4,Millwall!$Z82:$AK82,0)","v":5},{"$f":"MATCH(AD$4,Millwall!$Z82:$AK82,0)","v":{"$error":"#N/A"}},{"$f":"MATCH(AE$4,Millwall!$Z82:$AK82,0)","v":6},{"$f":"MATCH(AF$4,Millwall!$Z82:$AK82,0)","v":{"$error":"#N/A"}},{"$f":"MATCH(AG$4,Millwall!$Z82:$AK82,0)","v":{"$error":"#N/A"}},{"$f":"MATCH(AH$3,Millwall!$Z82:$AK82,0)","v":{"$error":"#N/A"}},{"$f":"MATCH(AI$3,Millwall!$Z82:$AK82,0)","v":9},{"$f":"MATCH(AJ$3,Millwall!$Z82:$AK82,0)","v":{"$error":"#N/A"}},{"$f":"MATCH(AK$3,Millwall!$Z82:$AK82,0)","v":{"$error":"#N/A"}},{"$f":"MATCH(AL$3,Millwall!$Z82:$AK82,0)","v":{"$error":"#N/A"}},{"$f":"MATCH(AM$3,Millwall!$Z82:$AK82,0)","v":{"$error":"#N/A"}},{"$f":"MATCH(AN$3,Millwall!$Z82:$AK82,0)","v":{"$error":"#N/A"}},{"$f":"MATCH(AO$3,Millwall!$Z82:$AK82,0)","v":{"$error":"#N/A"}},{"$f":"MATCH(AP$3,Millwall!$Z82:$AK82,0)","v":{"$error":"#N/A"}},{"$f":"MATCH(AQ$3,Millwall!$Z82:$AK82,0)","v":{"$error":"#N/A"}},{"$f":"MATCH(AR$3,Millwall!$Z82:$AK82,0)","v":{"$error":"#N/A"}},null,null,null,null,null,{"$f":"MATCH(AX$3,Millwall!$Z82:AK82,0)","v":{"$error":"#N/A"}},{"$f":"MATCH(AY$3,Millwall!$Z82:AK82,0)","v":{"$error":"#N/A"}},{"$f":"MATCH(AZ$3,Millwall!$Z82:AK82,0)","v":{"$error":"#N/A"}},{"$f":"MATCH(BA$3,Millwall!$Z82:AK82,0)","v":{"$error":"#N/A"}},{"$f":"MATCH(BB$3,Millwall!$Z82:AK82,0)","v":{"$error":"#N/A"}},{"$f":"MATCH(BC$3,Millwall!$Z82:AK82,0)","v":{"$error":"#N/A"}},{"$f":"MATCH(BD$3,Millwall!$Z82:AK82,0)","v":{"$error":"#N/A"}},{"$f":"MATCH(BE$3,Millwall!$Z82:AK82,0)","v":{"$error":"#N/A"}},{"$f":"MATCH(BF$3,Millwall!$Z82:AK82,0)","v":{"$error":"#N/A"}},{"$f":"MATCH(BG$3,Millwall!$Z82:AK82,0)","v":{"$error":"#N/A"}},{"$f":"MATCH(BH$3,Millwall!$Z82:AK82,0)","v":{"$error":"#N/A"}},{"$f":"MATCH(BI$3,Millwall!$Z82:AK82,0)","v":{"$error":"#N/A"}},{"$f":"MATCH(BJ$3,Millwall!$Z82:AK82,0)","v":{"$error":"#N/A"}},{"$f":"MATCH(BK$3,Millwall!$Z82:AK82,0)","v":{"$error":"#N/A"}},{"$f":"MATCH(BL$3,Millwall!$Z82:AK82,0)","v":{"$error":"#N/A"}},{"$f":"MATCH(BM$3,Millwall!$Z82:AK82,0)","v":{"$error":"#N/A"}},{"$f":"MATCH(BN$3,Millwall!$Z82:AK82,0)","v":{"$error":"#N/A"}},{"$f":"MATCH(BO$3,Millwall!$Z82:AK82,0)","v":{"$error":"#N/A"}},{"$f":"MATCH(BP$3,Millwall!$Z82:AK82,0)","v":{"$error":"#N/A"}},{"$f":"MATCH(BQ$3,Millwall!$Z82:AK82,0)","v":{"$error":"#N/A"}},{"$f":"MATCH(BR$3,Millwall!$Z82:AK82,0)","v":{"$error":"#N/A"}},{"$f":"MATCH(BS$3,Millwall!$Z82:AK82,0)","v":{"$error":"#N/A"}},{"$f":"MATCH(BT$3,Millwall!$Z82:AK82,0)","v":{"$error":"#N/A"}},{"$f":"MATCH(BU$3,Millwall!$Z82:AK82,0)","v":{"$error":"#N/A"}},{"$f":"MATCH(BV$3,Millwall!$Z82:AK82,0)","v":{"$error":"#N/A"}},{"$f":"MATCH(BW$3,Millwall!$Z82:AK82,0)","v":{"$error":"#N/A"}},{"$f":"MATCH(BX$3,Millwall!$Z82:AK82,0)","v":{"$error":"#N/A"}},{"$f":"MATCH(BY$3,Millwall!$Z82:AK82,0)","v":{"$error":"#N/A"}},{"$f":"MATCH(BZ$3,Millwall!$Z82:AK82,0)","v":{"$error":"#N/A"}},{"$f":"MATCH(CA$3,Millwall!$Z82:AK82,0)","v":{"$error":"#N/A"}},{"$f":"MATCH(CB$3,Millwall!$Z82:AK82,0)","v":{"$error":"#N/A"}},{"$f":"MATCH(CC$3,Millwall!$Z82:AK82,0)","v":{"$error":"#N/A"}},{"$f":"MATCH(CD$3,Millwall!$Z82:AK82,0)","v":{"$error":"#N/A"}},{"$f":"MATCH(CE$3,Millwall!$Z82:AK82,0)","v":{"$error":"#N/A"}},null,null,null,null,null,null,null,{"$f":"Millwall!$BN60","v":"Cripps"},{"$f":"Millwall!$BN60&\" (**\"","v":"Cripps (**"},{"$f":"Millwall!$BN60&\"**\"","v":"Cripps**"},null,{"$f":"$CM$12","v":"Cripps"},{"$f":"$CN$12","v":"Cripps (**"},{"$f":"$CO$12","v":"Cripps**"},null,{"$f":"Millwall!$BV$13","v":0}]
[null,null,0,9,null,{"$f":"Millwall!V83","v":"1974-09-21"},null,{"$f":"Millwall!W83","v":"Aston Villa"},{"$f":"Millwall!X83","v":"(A)"},{"$f":"Millwall!Y83","v":"L 0-3"},{"$f":"MATCH(K$4,Millwall!$Z83:$AK83,0)","v":6},{"$f":"MATCH(L$4,Millwall!$Z83:$AK83,0)","v":{"$error":"#N/A"}},{"$f":"MATCH(M$4,Millwall!$Z83:$AK83,0)","v":10},{"$f":"MATCH(N$4,Millwall!$Z83:$AK83,0)","v":{"$error":"#N/A"}},{"$f":"MATCH(O$4,Millwall!$Z83:$AK83,0)","v":{"$error":"#N/A"}},{"$f":"MATCH(P$4,Millwall!$Z83:$AK83,0)","v":{"$error":"#N/A"}},{"$f":"MATCH(Q$4,Millwall!$Z83:$AK83,0)","v":12},{"$f":"MATCH(R$4,Millwall!$Z83:$AK83,0)","v":{"$error":"#N/A"}},{"$f":"MATCH(S$4,Millwall!$Z83:$AK83,0)","v":{"$error":"#N/A"}},{"$f":"MATCH(T$4,Millwall!$Z83:$AK83,0)","v":2},{"$f":"MATCH(U$4,Millwall!$Z83:$AK83,0)","v":4},{"$f":"MATCH(V$4,Millwall!$Z83:$AK83,0)","v":{"$error":"#N/A"}},{"$f":"MATCH(W$4,Millwall!$Z83:$AK83,0)","v":{"$error":"#N/A"}},{"$f":"MATCH(X$4,Millwall!$Z83:$AK83,0)","v":11},{"$f":"MATCH(Y$4,Millwall!$Z83:$AK83,0)","v":3},{"$f":"MATCH(Z$4,Millwall!$Z83:$AK83,0)","v":{"$error":"#N/A"}},{"$f":"MATCH(AA$4,Millwall!$Z83:$AK83,0)","v":{"$error":"#N/A"}},{"$f":"MATCH(AB$4,Millwall!$Z83:$AK83,0)","v":1},{"$f":"MATCH(AC$4,Millwall!$Z83:$AK83,0)","v":5},{"$f":"MATCH(AD$4,Millwall!$Z83:$AK83,0)","v":{"$error":"#N/A"}},{"$f":"MATCH(AE$4,Millwall!$Z83:$AK83,0)","v":7},{"$f":"MATCH(AF$4,Millwall!$Z83:$AK83,0)","v":8},{"$f":"MATCH(AG$4,Millwall!$Z83:$AK83,0)","v":{"$error":"#N/A"}},{"$f":"MATCH(AH$3,Millwall!$Z83:$AK83,0)","v":{"$error":"#N/A"}},{"$f":"MATCH(AI$3,Millwall!$Z83:$AK83,0)","v":{"$error":"#N/A"}},{"$f":"MATCH(AJ$3,Millwall!$Z83:$AK83,0)","v":{"$error":"#N/A"}},{"$f":"MATCH(AK$3,Millwall!$Z83:$AK83,0)","v":{"$error":"#N/A"}},{"$f":"MATCH(AL$3,Millwall!$Z83:$AK83,0)","v":{"$error":"#N/A"}},{"$f":"MATCH(AM$3,Millwall!$Z83:$AK83,0)","v":{"$error":"#N/A"}},{"$f":"MATCH(AN$3,Millwall!$Z83:$AK83,0)","v":{"$error":"#N/A"}},{"$f":"MATCH(AO$3,Millwall!$Z83:$AK83,0)","v":{"$error":"#N/A"}},{"$f":"MATCH(AP$3,Millwall!$Z83:$AK83,0)","v":{"$error":"#N/A"}},{"$f":"MATCH(AQ$3,Millwall!$Z83:$AK83,0)","v":{"$error":"#N/A"}},{"$f":"MATCH(AR$3,Millwall!$Z83:$AK83,0)","v":{"$error":"#N/A"}},null,null,null,null,null,{"$f":"MATCH(AX$3,Millwall!$Z83:AK83,0)","v":{"$error":"#N/A"}},{"$f":"MATCH(AY$3,Millwall!$Z83:AK83,0)","v":{"$error":"#N/A"}},{"$f":"MATCH(AZ$3,Millwall!$Z83:AK83,0)","v":{"$error":"#N/A"}},{"$f":"MATCH(BA$3,Millwall!$Z83:AK83,0)","v":{"$error":"#N/A"}},{"$f":"MATCH(BB$3,Millwall!$Z83:AK83,0)","v":{"$error":"#N/A"}},{"$f":"MATCH(BC$3,Millwall!$Z83:AK83,0)","v":{"$error":"#N/A"}},{"$f":"MATCH(BD$3,Millwall!$Z83:AK83,0)","v":12},{"$f":"MATCH(BE$3,Millwall!$Z83:AK83,0)","v":{"$error":"#N/A"}},{"$f":"MATCH(BF$3,Millwall!$Z83:AK83,0)","v":{"$error":"#N/A"}},{"$f":"MATCH(BG$3,Millwall!$Z83:AK83,0)","v":{"$error":"#N/A"}},{"$f":"MATCH(BH$3,Millwall!$Z83:AK83,0)","v":{"$error":"#N/A"}},{"$f":"MATCH(BI$3,Millwall!$Z83:AK83,0)","v":{"$error":"#N/A"}},{"$f":"MATCH(BJ$3,Millwall!$Z83:AK83,0)","v":{"$error":"#N/A"}},{"$f":"MATCH(BK$3,Millwall!$Z83:AK83,0)","v":{"$error":"#N/A"}},{"$f":"MATCH(BL$3,Millwall!$Z83:AK83,0)","v":{"$error":"#N/A"}},{"$f":"MATCH(BM$3,Millwall!$Z83:AK83,0)","v":{"$error":"#N/A"}},{"$f":"MATCH(BN$3,Millwall!$Z83:AK83,0)","v":{"$error":"#N/A"}},{"$f":"MATCH(BO$3,Millwall!$Z83:AK83,0)","v":{"$error":"#N/A"}},{"$f":"MATCH(BP$3,Millwall!$Z83:AK83,0)","v":{"$error":"#N/A"}},{"$f":"MATCH(BQ$3,Millwall!$Z83:AK83,0)","v":{"$error":"#N/A"}},{"$f":"MATCH(BR$3,Millwall!$Z83:AK83,0)","v":{"$error":"#N/A"}},{"$f":"MATCH(BS$3,Millwall!$Z83:AK83,0)","v":{"$error":"#N/A"}},{"$f":"MATCH(BT$3,Millwall!$Z83:AK83,0)","v":{"$error":"#N/A"}},{"$f":"MATCH(BU$3,Millwall!$Z83:AK83,0)","v":{"$error":"#N/A"}},{"$f":"MATCH(BV$3,Millwall!$Z83:AK83,0)","v":9},{"$f":"MATCH(BW$3,Millwall!$Z83:AK83,0)","v":{"$error":"#N/A"}},{"$f":"MATCH(BX$3,Millwall!$Z83:AK83,0)","v":{"$error":"#N/A"}},{"$f":"MATCH(BY$3,Millwall!$Z83:AK83,0)","v":{"$error":"#N/A"}},{"$f":"MATCH(BZ$3,Millwall!$Z83:AK83,0)","v":{"$error":"#N/A"}},{"$f":"MATCH(CA$3,Millwall!$Z83:AK83,0)","v":{"$error":"#N/A"}},{"$f":"MATCH(CB$3,Millwall!$Z83:AK83,0)","v":{"$error":"#N/A"}},{"$f":"MATCH(CC$3,Millwall!$Z83:AK83,0)","v":{"$error":"#N/A"}},{"$f":"MATCH(CD$3,Millwall!$Z83:AK83,0)","v":{"$error":"#N/A"}},{"$f":"MATCH(CE$3,Millwall!$Z83:AK83,0)","v":{"$error":"#N/A"}},null,null,null,null,null,null,null,{"$f":"Millwall!$BN61","v":"Dillon"},{"$f":"Millwall!$BN61&\" (**\"","v":"Dillon (**"},{"$f":"Millwall!$BN61&\"**\"","v":"Dillon**"},null,{"$f":"$CM$13","v":"Dillon"},{"$f":"$CN$13","v":"Dillon (**"},{"$f":"$CO$13","v":"Dillon**"},null,{"$f":"Millwall!$BV$14","v":0}]
[null,null,0,10,null,{"$f":"Millwall!V84","v":"1974-09-24"},null,{"$f":"Millwall!W84","v":"Hull City"},{"$f":"Millwall!X84","v":"(A)"},{"$f":"Millwall!Y84","v":"D 1-1"},{"$f":"MATCH(K$4,Millwall!$Z84:$AK84,0)","v":10},{"$f":"MATCH(L$4,Millwall!$Z84:$AK84,0)","v":{"$error":"#N/A"}},{"$f":"MATCH(M$4,Millwall!$Z84:$AK84,0)","v":7},{"$f":"MATCH(N$4,Millwall!$Z84:$AK84,0)","v":2},{"$f":"MATCH(O$4,Millwall!$Z84:$AK84,0)","v":{"$error":"#N/A"}},{"$f":"MATCH(P$4,Millwall!$Z84:$AK84,0)","v":{"$error":"#N/A"}},{"$f":"MATCH(Q$4,Millwall!$Z84:$AK84,0)","v":{"$error":"#N/A"}},{"$f":"MATCH(R$4,Millwall!$Z84:$AK84,0)","v":{"$error":"#N/A"}},{"$f":"MATCH(S$4,Millwall!$Z84:$AK84,0)","v":{"$error":"#N/A"}},{"$f":"MATCH(T$4,Millwall!$Z84:$AK84,0)","v":4},{"$f":"MATCH(U$4,Millwall!$Z84:$AK84,0)","v":6},{"$f":"MATCH(V$4,Millwall!$Z84:$AK84,0)","v":{"$error":"#N/A"}},{"$f":"MATCH(W$4,Millwall!$Z84:$AK84,0)","v":{"$error":"#N/A"}},{"$f":"MATCH(X$4,Millwall!$Z84:$AK84,0)","v":11},{"$f":"MATCH(Y$4,Millwall!$Z84:$AK84,0)","v":3},{"$f":"MATCH(Z$4,Millwall!$Z84:$AK84,0)","v":{"$error":"#N/A"}},{"$f":"MATCH(AA$4,Millwall!$Z84:$AK84,0)","v":{"$error":"#N/A"}},{"$f":"MATCH(AB$4,Millwall!$Z84:$AK84,0)","v":1},{"$f":"MATCH(AC$4,Millwall!$Z84:$AK84,0)","v":5},{"$f":"MATCH(AD$4,Millwall!$Z84:$AK84,0)","v":{"$error":"#N/A"}},{"$f":"MATCH(AE$4,Millwall!$Z84:$AK84,0)","v":8},{"$f":"MATCH(AF$4,Millwall!$Z84:$AK84,0)","v":9},{"$f":"MATCH(AG$4,Millwall!$Z84:$AK84,0)","v":{"$error":"#N/A"}},{"$f":"MATCH(AH$3,Millwall!$Z84:$AK84,0)","v":{"$error":"#N/A"}},{"$f":"MATCH(AI$3,Millwall!$Z84:$AK84,0)","v":{"$error":"#N/A"}},{"$f":"MATCH(AJ$3,Millwall!$Z84:$AK84,0)","v":{"$error":"#N/A"}},{"$f":"MATCH(AK$3,Millwall!$Z84:$AK84,0)","v":{"$error":"#N/A"}},{"$f":"MATCH(AL$3,Millwall!$Z84:$AK84,0)","v":{"$error":"#N/A"}},{"$f":"MATCH(AM$3,Millwall!$Z84:$AK84,0)","v":{"$error":"#N/A"}},{"$f":"MATCH(AN$3,Millwall!$Z84:$AK84,0)","v":{"$error":"#N/A"}},{"$f":"MATCH(AO$3,Millwall!$Z84:$AK84,0)","v":{"$error":"#N/A"}},{"$f":"MATCH(AP$3,Millwall!$Z84:$AK84,0)","v":{"$error":"#N/A"}},{"$f":"MATCH(AQ$3,Millwall!$Z84:$AK84,0)","v":{"$error":"#N/A"}},{"$f":"MATCH(AR$3,Millwall!$Z84:$AK84,0)","v":{"$error":"#N/A"}},null,null,null,null,null,{"$f":"MATCH(AX$3,Millwall!$Z84:AK84,0)","v":{"$error":"#N/A"}},{"$f":"MATCH(AY$3,Millwall!$Z84:AK84,0)","v":{"$error":"#N/A"}},{"$f":"MATCH(AZ$3,Millwall!$Z84:AK84,0)","v":{"$error":"#N/A"}},{"$f":"MATCH(BA$3,Millwall!$Z84:AK84,0)","v":{"$error":"#N/A"}},{"$f":"MATCH(BB$3,Millwall!$Z84:AK84,0)","v":{"$error":"#N/A"}},{"$f":"MATCH(BC$3,Millwall!$Z84:AK84,0)","v":{"$error":"#N/A"}},{"$f":"MATCH(BD$3,Millwall!$Z84:AK84,0)","v":{"$error":"#N/A"}},{"$f":"MATCH(BE$3,Millwall!$Z84:AK84,0)","v":{"$error":"#N/A"}},{"$f":"MATCH(BF$3,Millwall!$Z84:AK84,0)","v":{"$error":"#N/A"}},{"$f":"MATCH(BG$3,Millwall!$Z84:AK84,0)","v":{"$error":"#N/A"}},{"$f":"MATCH(BH$3,Millwall!$Z84:AK84,0)","v":{"$error":"#N/A"}},{"$f":"MATCH(BI$3,Millwall!$Z84:AK84,0)","v":{"$error":"#N/A"}},{"$f":"MATCH(BJ$3,Millwall!$Z84:AK84,0)","v":{"$error":"#N/A"}},{"$f":"MATCH(BK$3,Millwall!$Z84:AK84,0)","v":{"$error":"#N/A"}},{"$f":"MATCH(BL$3,Millwall!$Z84:AK84,0)","v":{"$error":"#N/A"}},{"$f":"MATCH(BM$3,Millwall!$Z84:AK84,0)","v":{"$error":"#N/A"}},{"$f":"MATCH(BN$3,Millwall!$Z84:AK84,0)","v":{"$error":"#N/A"}},{"$f":"MATCH(BO$3,Millwall!$Z84:AK84,0)","v":{"$error":"#N/A"}},{"$f":"MATCH(BP$3,Millwall!$Z84:AK84,0)","v":{"$error":"#N/A"}},{"$f":"MATCH(BQ$3,Millwall!$Z84:AK84,0)","v":{"$error":"#N/A"}},{"$f":"MATCH(BR$3,Millwall!$Z84:AK84,0)","v":{"$error":"#N/A"}},{"$f":"MATCH(BS$3,Millwall!$Z84:AK84,0)","v":{"$error":"#N/A"}},{"$f":"MATCH(BT$3,Millwall!$Z84:AK84,0)","v":{"$error":"#N/A"}},{"$f":"MATCH(BU$3,Millwall!$Z84:AK84,0)","v":{"$error":"#N/A"}},{"$f":"MATCH(BV$3,Millwall!$Z84:AK84,0)","v":{"$error":"#N/A"}},{"$f":"MATCH(BW$3,Millwall!$Z84:AK84,0)","v":{"$error":"#N/A"}},{"$f":"MATCH(BX$3,Millwall!$Z84:AK84,0)","v":{"$error":"#N/A"}},{"$f":"MATCH(BY$3,Millwall!$Z84:AK84,0)","v":{"$error":"#N/A"}},{"$f":"MATCH(BZ$3,Millwall!$Z84:AK84,0)","v":{"$error":"#N/A"}},{"$f":"MATCH(CA$3,Millwall!$Z84:AK84,0)","v":{"$error":"#N/A"}},{"$f":"MATCH(CB$3,Millwall!$Z84:AK84,0)","v":{"$error":"#N/A"}},{"$f":"MATCH(CC$3,Millwall!$Z84:AK84,0)","v":{"$error":"#N/A"}},{"$f":"MATCH(CD$3,Millwall!$Z84:AK84,0)","v":{"$error":"#N/A"}},{"$f":"MATCH(CE$3,Millwall!$Z84:AK84,0)","v":{"$error":"#N/A"}},null,null,null,null,null,null,null,{"$f":"Millwall!$BN62","v":"Donaldson"},{"$f":"Millwall!$BN62&\" (**\"","v":"Donaldson (**"},{"$f":"Millwall!$BN62&\"**\"","v":"Donaldson**"},null,{"$f":"$CM$14","v":"Donaldson"},{"$f":"$CN$14","v":"Donaldson (**"},{"$f":"$CO$14","v":"Donaldson**"},null,{"$f":"Millwall!$BV$15","v":1}]
[null,null,0,11,null,{"$f":"Millwall!V85","v":"1974-09-28"},null,{"$f":"Millwall!W85","v":"Bristol C"},{"$f":"Millwall!X85","v":"(H)"},{"$f":"Millwall!Y85","v":"W 1-0"},{"$f":"MATCH(K$4,Millwall!$Z85:$AK85,0)","v":10},{"$f":"MATCH(L$4,Millwall!$Z85:$AK85,0)","v":{"$error":"#N/A"}},{"$f":"MATCH(M$4,Millwall!$Z85:$AK85,0)","v":9},{"$f":"MATCH(N$4,Millwall!$Z85:$AK85,0)","v":2},{"$f":"MATCH(O$4,Millwall!$Z85:$AK85,0)","v":{"$error":"#N/A"}},{"$f":"MATCH(P$4,Millwall!$Z85:$AK85,0)","v":{"$error":"#N/A"}},{"$f":"MATCH(Q$4,Millwall!$Z85:$AK85,0)","v":{"$error":"#N/A"}},{"$f":"MATCH(R$4,Millwall!$Z85:$AK85,0)","v":{"$error":"#N/A"}},{"$f":"MATCH(S$4,Millwall!$Z85:$AK85,0)","v":{"$error":"#N/A"}},{"$f":"MATCH(T$4,Millwall!$Z85:$AK85,0)","v":4},{"$f":"MATCH(U$4,Millwall!$Z85:$AK85,0)","v":6},{"$f":"MATCH(V$4,Millwall!$Z85:$AK85,0)","v":{"$error":"#N/A"}},{"$f":"MATCH(W$4,Millwall!$Z85:$AK85,0)","v":{"$error":"#N/A"}},{"$f":"MATCH(X$4,Millwall!$Z85:$AK85,0)","v":11},{"$f":"MATCH(Y$4,Millwall!$Z85:$AK85,0)","v":3},{"$f":"MATCH(Z$4,Millwall!$Z85:$AK85,0)","v":{"$error":"#N/A"}},{"$f":"MATCH(AA$4,Millwall!$Z85:$AK85,0)","v":{"$error":"#N/A"}},{"$f":"MATCH(AB$4,Millwall!$Z85:$AK85,0)","v":1},{"$f":"MATCH(AC$4,Millwall!$Z85:$AK85,0)","v":5},{"$f":"MATCH(AD$4,Millwall!$Z85:$AK85,0)","v":{"$error":"#N/A"}},{"$f":"MATCH(AE$4,Millwall!$Z85:$AK85,0)","v":7},{"$f":"MATCH(AF$4,Millwall!$Z85:$AK85,0)","v":8},{"$f":"MATCH(AG$4,Millwall!$Z85:$AK85,0)","v":{"$error":"#N/A"}},{"$f":"MATCH(AH$3,Millwall!$Z85:$AK85,0)","v":{"$error":"#N/A"}},{"$f":"MATCH(AI$3,Millwall!$Z85:$AK85,0)","v":{"$error":"#N/A"}},{"$f":"MATCH(AJ$3,Millwall!$Z85:$AK85,0)","v":{"$error":"#N/A"}},{"$f":"MATCH(AK$3,Millwall!$Z85:$AK85,0)","v":{"$error":"#N/A"}},{"$f":"MATCH(AL$3,Millwall!$Z85:$AK85,0)","v":{"$error":"#N/A"}},{"$f":"MATCH(AM$3,Millwall!$Z85:$AK85,0)","v":{"$error":"#N/A"}},{"$f":"MATCH(AN$3,Millwall!$Z85:$AK85,0)","v":{"$error":"#N/A"}},{"$f":"MATCH(AO$3,Millwall!$Z85:$AK85,0)","v":{"$error":"#N/A"}},{"$f":"MATCH(AP$3,Millwall!$Z85:$AK85,0)","v":{"$error":"#N/A"}},{"$f":"MATCH(AQ$3,Millwall!$Z85:$AK85,0)","v":{"$error":"#N/A"}},{"$f":"MATCH(AR$3,Millwall!$Z85:$AK85,0)","v":{"$error":"#N/A"}},null,null,null,null,null,{"$f":"MATCH(AX$3,Millwall!$Z85:AK85,0)","v":{"$error":"#N/A"}},{"$f":"MATCH(AY$3,Millwall!$Z85:AK85,0)","v":{"$error":"#N/A"}},{"$f":"MATCH(AZ$3,Millwall!$Z85:AK85,0)","v":{"$error":"#N/A"}},{"$f":"MATCH(BA$3,Millwall!$Z85:AK85,0)","v":{"$error":"#N/A"}},{"$f":"MATCH(BB$3,Millwall!$Z85:AK85,0)","v":{"$error":"#N/A"}},{"$f":"MATCH(BC$3,Millwall!$Z85:AK85,0)","v":{"$error":"#N/A"}},{"$f":"MATCH(BD$3,Millwall!$Z85:AK85,0)","v":{"$error":"#N/A"}},{"$f":"MATCH(BE$3,Millwall!$Z85:AK85,0)","v":{"$error":"#N/A"}},{"$f":"MATCH(BF$3,Millwall!$Z85:AK85,0)","v":{"$error":"#N/A"}},{"$f":"MATCH(BG$3,Millwall!$Z85:AK85,0)","v":{"$error":"#N/A"}},{"$f":"MATCH(BH$3,Millwall!$Z85:AK85,0)","v":{"$error":"#N/A"}},{"$f":"MATCH(BI$3,Millwall!$Z85:AK85,0)","v":{"$error":"#N/A"}},{"$f":"MATCH(BJ$3,Millwall!$Z85:AK85,0)","v":{"$error":"#N/A"}},{"$f":"MATCH(BK$3,Millwall!$Z85:AK85,0)","v":{"$error":"#N/A"}},{"$f":"MATCH(BL$3,Millwall!$Z85:AK85,0)","v":{"$error":"#N/A"}},{"$f":"MATCH(BM$3,Millwall!$Z85:AK85,0)","v":{"$error":"#N/A"}},{"$f":"MATCH(BN$3,Millwall!$Z85:AK85,0)","v":{"$error":"#N/A"}},{"$f":"MATCH(BO$3,Millwall!$Z85:AK85,0)","v":{"$error":"#N/A"}},{"$f":"MATCH(BP$3,Millwall!$Z85:AK85,0)","v":{"$error":"#N/A"}},{"$f":"MATCH(BQ$3,Millwall!$Z85:AK85,0)","v":{"$error":"#N/A"}},{"$f":"MATCH(BR$3,Millwall!$Z85:AK85,0)","v":{"$error":"#N/A"}},{"$f":"MATCH(BS$3,Millwall!$Z85:AK85,0)","v":8},{"$f":"MATCH(BT$3,Millwall!$Z85:AK85,0)","v":{"$error":"#N/A"}},{"$f":"MATCH(BU$3,Millwall!$Z85:AK85,0)","v":{"$error":"#N/A"}},{"$f":"MATCH(BV$3,Millwall!$Z85:AK85,0)","v":12},{"$f":"MATCH(BW$3,Millwall!$Z85:AK85,0)","v":{"$error":"#N/A"}},{"$f":"MATCH(BX$3,Millwall!$Z85:AK85,0)","v":{"$error":"#N/A"}},{"$f":"MATCH(BY$3,Millwall!$Z85:AK85,0)","v":{"$error":"#N/A"}},{"$f":"MATCH(BZ$3,Millwall!$Z85:AK85,0)","v":{"$error":"#N/A"}},{"$f":"MATCH(CA$3,Millwall!$Z85:AK85,0)","v":{"$error":"#N/A"}},{"$f":"MATCH(CB$3,Millwall!$Z85:AK85,0)","v":{"$error":"#N/A"}},{"$f":"MATCH(CC$3,Millwall!$Z85:AK85,0)","v":{"$error":"#N/A"}},{"$f":"MATCH(CD$3,Millwall!$Z85:AK85,0)","v":{"$error":"#N/A"}},{"$f":"MATCH(CE$3,Millwall!$Z85:AK85,0)","v":{"$error":"#N/A"}},null,null,null,null,null,null,null,{"$f":"Millwall!$BN63","v":"Dorney"},{"$f":"Millwall!$BN63&\" (**\"","v":"Dorney (**"},{"$f":"Millwall!$BN63&\"**\"","v":"Dorney**"},null,{"$f":"$CM$15","v":"Dorney"},{"$f":"$CN$15","v":"Dorney (**"},{"$f":"$CO$15","v":"Dorney**"},null,{"$f":"Millwall!$BV$16","v":1}]
[null,null,0,12,null,{"$f":"Millwall!V86","v":"1974-10-05"},null,{"$f":"Millwall!W86","v":"Norwich"},{"$f":"Millwall!X86","v":"(A)"},{"$f":"Millwall!Y86","v":"L 0-2"},{"$f":"MATCH(K$4,Millwall!$Z86:$AK86,0)","v":10},{"$f":"MATCH(L$4,Millwall!$Z86:$AK86,0)","v":{"$error":"#N/A"}},{"$f":"MATCH(M$4,Millwall!$Z86:$AK86,0)","v":8},{"$f":"MATCH(N$4,Millwall!$Z86:$AK86,0)","v":2},{"$f":"MATCH(O$4,Millwall!$Z86:$AK86,0)","v":{"$error":"#N/A"}},{"$f":"MATCH(P$4,Millwall!$Z86:$AK86,0)","v":{"$error":"#N/A"}},{"$f":"MATCH(Q$4,Millwall!$Z86:$AK86,0)","v":{"$error":"#N/A"}},{"$f":"MATCH(R$4,Millwall!$Z86:$AK86,0)","v":{"$error":"#N/A"}},{"$f":"MATCH(S$4,Millwall!$Z86:$AK86,0)","v":{"$error":"#N/A"}},{"$f":"MATCH(T$4,Millwall!$Z86:$AK86,0)","v":4},{"$f":"MATCH(U$4,Millwall!$Z86:$AK86,0)","v":6},{"$f":"MATCH(V$4,Millwall!$Z86:$AK86,0)","v":{"$error":"#N/A"}},{"$f":"MATCH(W$4,Millwall!$Z86:$AK86,0)","v":{"$error":"#N/A"}},{"$f":"MATCH(X$4,Millwall!$Z86:$AK86,0)","v":11},{"$f":"MATCH(Y$4,Millwall!$Z86:$AK86,0)","v":3},{"$f":"MATCH(Z$4,Millwall!$Z86:$AK86,0)","v":{"$error":"#N/A"}},{"$f":"MATCH(AA$4,Millwall!$Z86:$AK86,0)","v":{"$error":"#N/A"}},{"$f":"MATCH(AB$4,Millwall!$Z86:$AK86,0)","v":1},{"$f":"MATCH(AC$4,Millwall!$Z86:$AK86,0)","v":5},{"$f":"MATCH(AD$4,Millwall!$Z86:$AK86,0)","v":{"$error":"#N/A"}},{"$f":"MATCH(AE$4,Millwall!$Z86:$AK86,0)","v":7},{"$f":"MATCH(AF$4,Millwall!$Z86:$AK86,0)","v":{"$error":"#N/A"}},{"$f":"MATCH(AG$4,Millwall!$Z86:$AK86,0)","v":{"$error":"#N/A"}},{"$f":"MATCH(AH$3,Millwall!$Z86:$AK86,0)","v":{"$error":"#N/A"}},{"$f":"MATCH(AI$3,Millwall!$Z86:$AK86,0)","v":9},{"$f":"MATCH(AJ$3,Millwall!$Z86:$AK86,0)","v":{"$error":"#N/A"}},{"$f":"MATCH(AK$3,Millwall!$Z86:$AK86,0)","v":{"$error":"#N/A"}},{"$f":"MATCH(AL$3,Millwall!$Z86:$AK86,0)","v":{"$error":"#N/A"}},{"$f":"MATCH(AM$3,Millwall!$Z86:$AK86,0)","v":{"$error":"#N/A"}},{"$f":"MATCH(AN$3,Millwall!$Z86:$AK86,0)","v":{"$error":"#N/A"}},{"$f":"MATCH(AO$3,Millwall!$Z86:$AK86,0)","v":{"$error":"#N/A"}},{"$f":"MATCH(AP$3,Millwall!$Z86:$AK86,0)","v":{"$error":"#N/A"}},{"$f":"MATCH(AQ$3,Millwall!$Z86:$AK86,0)","v":{"$error":"#N/A"}},{"$f":"MATCH(AR$3,Millwall!$Z86:$AK86,0)","v":{"$error":"#N/A"}},null,null,null,null,null,{"$f":"MATCH(AX$3,Millwall!$Z86:AK86,0)","v":{"$error":"#N/A"}},{"$f":"MATCH(AY$3,Millwall!$Z86:AK86,0)","v":{"$error":"#N/A"}},{"$f":"MATCH(AZ$3,Millwall!$Z86:AK86,0)","v":{"$error":"#N/A"}},{"$f":"MATCH(BA$3,Millwall!$Z86:AK86,0)","v":{"$error":"#N/A"}},{"$f":"MATCH(BB$3,Millwall!$Z86:AK86,0)","v":{"$error":"#N/A"}},{"$f":"MATCH(BC$3,Millwall!$Z86:AK86,0)","v":{"$error":"#N/A"}},{"$f":"MATCH(BD$3,Millwall!$Z86:AK86,0)","v":{"$error":"#N/A"}},{"$f":"MATCH(BE$3,Millwall!$Z86:AK86,0)","v":{"$error":"#N/A"}},{"$f":"MATCH(BF$3,Millwall!$Z86:AK86,0)","v":{"$error":"#N/A"}},{"$f":"MATCH(BG$3,Millwall!$Z86:AK86,0)","v":{"$error":"#N/A"}},{"$f":"MATCH(BH$3,Millwall!$Z86:AK86,0)","v":{"$error":"#N/A"}},{"$f":"MATCH(BI$3,Millwall!$Z86:AK86,0)","v":{"$error":"#N/A"}},{"$f":"MATCH(BJ$3,Millwall!$Z86:AK86,0)","v":{"$error":"#N/A"}},{"$f":"MATCH(BK$3,Millwall!$Z86:AK86,0)","v":{"$error":"#N/A"}},{"$f":"MATCH(BL$3,Millwall!$Z86:AK86,0)","v":{"$error":"#N/A"}},{"$f":"MATCH(BM$3,Millwall!$Z86:AK86,0)","v":{"$error":"#N/A"}},{"$f":"MATCH(BN$3,Millwall!$Z86:AK86,0)","v":{"$error":"#N/A"}},{"$f":"MATCH(BO$3,Millwall!$Z86:AK86,0)","v":{"$error":"#N/A"}},{"$f":"MATCH(BP$3,Millwall!$Z86:AK86,0)","v":{"$error":"#N/A"}},{"$f":"MATCH(BQ$3,Millwall!$Z86:AK86,0)","v":{"$error":"#N/A"}},{"$f":"MATCH(BR$3,Millwall!$Z86:AK86,0)","v":{"$error":"#N/A"}},{"$f":"MATCH(BS$3,Millwall!$Z86:AK86,0)","v":{"$error":"#N/A"}},{"$f":"MATCH(BT$3,Millwall!$Z86:AK86,0)","v":{"$error":"#N/A"}},{"$f":"MATCH(BU$3,Millwall!$Z86:AK86,0)","v":{"$error":"#N/A"}},{"$f":"MATCH(BV$3,Millwall!$Z86:AK86,0)","v":{"$error":"#N/A"}},{"$f":"MATCH(BW$3,Millwall!$Z86:AK86,0)","v":{"$error":"#N/A"}},{"$f":"MATCH(BX$3,Millwall!$Z86:AK86,0)","v":{"$error":"#N/A"}},{"$f":"MATCH(BY$3,Millwall!$Z86:AK86,0)","v":{"$error":"#N/A"}},{"$f":"MATCH(BZ$3,Millwall!$Z86:AK86,0)","v":{"$error":"#N/A"}},{"$f":"MATCH(CA$3,Millwall!$Z86:AK86,0)","v":{"$error":"#N/A"}},{"$f":"MATCH(CB$3,Millwall!$Z86:AK86,0)","v":{"$error":"#N/A"}},{"$f":"MATCH(CC$3,Millwall!$Z86:AK86,0)","v":{"$error":"#N/A"}},{"$f":"MATCH(CD$3,Millwall!$Z86:AK86,0)","v":{"$error":"#N/A"}},{"$f":"MATCH(CE$3,Millwall!$Z86:AK86,0)","v":{"$error":"#N/A"}},null,null,null,null,null,null,null,{"$f":"Millwall!$BN64","v":"Evans"},{"$f":"Millwall!$BN64&\" (**\"","v":"Evans (**"},{"$f":"Millwall!$BN64&\"**\"","v":"Evans**"},null,{"$f":"$CM$16","v":"Evans"},{"$f":"$CN$16","v":"Evans (**"},{"$f":"$CO$16","v":"Evans**"},null,{"$f":"Millwall!$BV$17","v":1}]
[null,null,0,13,null,{"$f":"Millwall!V87","v":"1974-10-12"},null,{"$f":"Millwall!W87","v":"Southampton"},{"$f":"Millwall!X87","v":"(H)"},{"$f":"Millwall!Y87","v":"W 4-0"},{"$f":"MATCH(K$4,Millwall!$Z87:$AK87,0)","v":11},{"$f":"MATCH(L$4,Millwall!$Z87:$AK87,0)","v":{"$error":"#N/A"}},{"$f":"MATCH(M$4,Millwall!$Z87:$AK87,0)","v":10},{"$f":"MATCH(N$4,Millwall!$Z87:$AK87,0)","v":2},{"$f":"MATCH(O$4,Millwall!$Z87:$AK87,0)","v":{"$error":"#N/A"}},{"$f":"MATCH(P$4,Millwall!$Z87:$AK87,0)","v":{"$error":"#N/A"}},{"$f":"MATCH(Q$4,Millwall!$Z87:$AK87,0)","v":8},{"$f":"MATCH(R$4,Millwall!$Z87:$AK87,0)","v":{"$error":"#N/A"}},{"$f":"MATCH(S$4,Millwall!$Z87:$AK87,0)","v":{"$error":"#N/A"}},{"$f":"MATCH(T$4,Millwall!$Z87:$AK87,0)","v":4},{"$f":"MATCH(U$4,Millwall!$Z87:$AK87,0)","v":6},{"$f":"MATCH(V$4,Millwall!$Z87:$AK87,0)","v":{"$error":"#N/A"}},{"$f":"MATCH(W$4,Millwall!$Z87:$AK87,0)","v":{"$error":"#N/A"}},{"$f":"MATCH(X$4,Millwall!$Z87:$AK87,0)","v":{"$error":"#N/A"}},{"$f":"MATCH(Y$4,Millwall!$Z87:$AK87,0)","v":3},{"$f":"MATCH(Z$4,Millwall!$Z87:$AK87,0)","v":{"$error":"#N/A"}},{"$f":"MATCH(AA$4,Millwall!$Z87:$AK87,0)","v":{"$error":"#N/A"}},{"$f":"MATCH(AB$4,Millwall!$Z87:$AK87,0)","v":1},{"$f":"MATCH(AC$4,Millwall!$Z87:$AK87,0)","v":5},{"$f":"MATCH(AD$4,Millwall!$Z87:$AK87,0)","v":{"$error":"#N/A"}},{"$f":"MATCH(AE$4,Millwall!$Z87:$AK87,0)","v":7},{"$f":"MATCH(AF$4,Millwall!$Z87:$AK87,0)","v":{"$error":"#N/A"}},{"$f":"MATCH(AG$4,Millwall!$Z87:$AK87,0)","v":{"$error":"#N/A"}},{"$f":"MATCH(AH$3,Millwall!$Z87:$AK87,0)","v":{"$error":"#N/A"}},{"$f":"MATCH(AI$3,Millwall!$Z87:$AK87,0)","v":9},{"$f":"MATCH(AJ$3,Millwall!$Z87:$AK87,0)","v":{"$error":"#N/A"}},{"$f":"MATCH(AK$3,Millwall!$Z87:$AK87,0)","v":{"$error":"#N/A"}},{"$f":"MATCH(AL$3,Millwall!$Z87:$AK87,0)","v":{"$error":"#N/A"}},{"$f":"MATCH(AM$3,Millwall!$Z87:$AK87,0)","v":{"$error":"#N/A"}},{"$f":"MATCH(AN$3,Millwall!$Z87:$AK87,0)","v":{"$error":"#N/A"}},{"$f":"MATCH(AO$3,Millwall!$Z87:$AK87,0)","v":{"$error":"#N/A"}},{"$f":"MATCH(AP$3,Millwall!$Z87:$AK87,0)","v":{"$error":"#N/A"}},{"$f":"MATCH(AQ$3,Millwall!$Z87:$AK87,0)","v":{"$error":"#N/A"}},{"$f":"MATCH(AR$3,Millwall!$Z87:$AK87,0)","v":{"$error":"#N/A"}},null,null,null,null,null,{"$f":"MATCH(AX$3,Millwall!$Z87:AK87,0)","v":{"$error":"#N/A"}},{"$f":"MATCH(AY$3,Millwall!$Z87:AK87,0)","v":{"$error":"#N/A"}},{"$f":"MATCH(AZ$3,Millwall!$Z87:AK87,0)","v":{"$error":"#N/A"}},{"$f":"MATCH(BA$3,Millwall!$Z87:AK87,0)","v":{"$error":"#N/A"}},{"$f":"MATCH(BB$3,Millwall!$Z87:AK87,0)","v":{"$error":"#N/A"}},{"$f":"MATCH(BC$3,Millwall!$Z87:AK87,0)","v":{"$error":"#N/A"}},{"$f":"MATCH(BD$3,Millwall!$Z87:AK87,0)","v":{"$error":"#N/A"}},{"$f":"MATCH(BE$3,Millwall!$Z87:AK87,0)","v":{"$error":"#N/A"}},{"$f":"MATCH(BF$3,Millwall!$Z87:AK87,0)","v":{"$error":"#N/A"}},{"$f":"MATCH(BG$3,Millwall!$Z87:AK87,0)","v":{"$error":"#N/A"}},{"$f":"MATCH(BH$3,Millwall!$Z87:AK87,0)","v":{"$error":"#N/A"}},{"$f":"MATCH(BI$3,Millwall!$Z87:AK87,0)","v":{"$error":"#N/A"}},{"$f":"MATCH(BJ$3,Millwall!$Z87:AK87,0)","v":{"$error":"#N/A"}},{"$f":"MATCH(BK$3,Millwall!$Z87:AK87,0)","v":{"$error":"#N/A"}},{"$f":"MATCH(BL$3,Millwall!$Z87:AK87,0)","v":{"$error":"#N/A"}},{"$f":"MATCH(BM$3,Millwall!$Z87:AK87,0)","v":{"$error":"#N/A"}},{"$f":"MATCH(BN$3,Millwall!$Z87:AK87,0)","v":{"$error":"#N/A"}},{"$f":"MATCH(BO$3,Millwall!$Z87:AK87,0)","v":{"$error":"#N/A"}},{"$f":"MATCH(BP$3,Millwall!$Z87:AK87,0)","v":{"$error":"#N/A"}},{"$f":"MATCH(BQ$3,Millwall!$Z87:AK87,0)","v":{"$error":"#N/A"}},{"$f":"MATCH(BR$3,Millwall!$Z87:AK87,0)","v":{"$error":"#N/A"}},{"$f":"MATCH(BS$3,Millwall!$Z87:AK87,0)","v":{"$error":"#N/A"}},{"$f":"MATCH(BT$3,Millwall!$Z87:AK87,0)","v":{"$error":"#N/A"}},{"$f":"MATCH(BU$3,Millwall!$Z87:AK87,0)","v":{"$error":"#N/A"}},{"$f":"MATCH(BV$3,Millwall!$Z87:AK87,0)","v":{"$error":"#N/A"}},{"$f":"MATCH(BW$3,Millwall!$Z87:AK87,0)","v":{"$error":"#N/A"}},{"$f":"MATCH(BX$3,Millwall!$Z87:AK87,0)","v":{"$error":"#N/A"}},{"$f":"MATCH(BY$3,Millwall!$Z87:AK87,0)","v":{"$error":"#N/A"}},{"$f":"MATCH(BZ$3,Millwall!$Z87:AK87,0)","v":{"$error":"#N/A"}},{"$f":"MATCH(CA$3,Millwall!$Z87:AK87,0)","v":{"$error":"#N/A"}},{"$f":"MATCH(CB$3,Millwall!$Z87:AK87,0)","v":{"$error":"#N/A"}},{"$f":"MATCH(CC$3,Millwall!$Z87:AK87,0)","v":{"$error":"#N/A"}},{"$f":"MATCH(CD$3,Millwall!$Z87:AK87,0)","v":{"$error":"#N/A"}},{"$f":"MATCH(CE$3,Millwall!$Z87:AK87,0)","v":{"$error":"#N/A"}},null,null,null,null,null,null,null,{"$f":"Millwall!$BN65","v":"Hazell"},{"$f":"Millwall!$BN65&\" (**\"","v":"Hazell (**"},{"$f":"Millwall!$BN65&\"**\"","v":"Hazell**"},null,{"$f":"$CM$17","v":"Hazell"},{"$f":"$CN$17","v":"Hazell (**"},{"$f":"$CO$17","v":"Hazell**"},null,{"$f":"Millwall!$BV$18","v":2}]
[null,null,0,14,null,{"$f":"Millwall!V88","v":"1974-10-19"},null,{"$f":"Millwall!W88","v":"Bristol R"},{"$f":"Millwall!X88","v":"(A)"},{"$f":"Millwall!Y88","v":"L 0-2"},{"$f":"MATCH(K$4,Millwall!$Z88:$AK88,0)","v":11},{"$f":"MATCH(L$4,Millwall!$Z88:$AK88,0)","v":{"$error":"#N/A"}},{"$f":"MATCH(M$4,Millwall!$Z88:$AK88,0)","v":7},{"$f":"MATCH(N$4,Millwall!$Z88:$AK88,0)","v":2},{"$f":"MATCH(O$4,Millwall!$Z88:$AK88,0)","v":{"$error":"#N/A"}},{"$f":"MATCH(P$4,Millwall!$Z88:$AK88,0)","v":{"$error":"#N/A"}},{"$f":"MATCH(Q$4,Millwall!$Z88:$AK88,0)","v":10},{"$f":"MATCH(R$4,Millwall!$Z88:$AK88,0)","v":{"$error":"#N/A"}},{"$f":"MATCH(S$4,Millwall!$Z88:$AK88,0)","v":{"$error":"#N/A"}},{"$f":"MATCH(T$4,Millwall!$Z88:$AK88,0)","v":4},{"$f":"MATCH(U$4,Millwall!$Z88:$AK88,0)","v":6},{"$f":"MATCH(V$4,Millwall!$Z88:$AK88,0)","v":{"$error":"#N/A"}},{"$f":"MATCH(W$4,Millwall!$Z88:$AK88,0)","v":{"$error":"#N/A"}},{"$f":"MATCH(X$4,Millwall!$Z88:$AK88,0)","v":12},{"$f":"MATCH(Y$4,Millwall!$Z88:$AK88,0)","v":3},{"$f":"MATCH(Z$4,Millwall!$Z88:$AK88,0)","v":{"$error":"#N/A"}},{"$f":"MATCH(AA$4,Millwall!$Z88:$AK88,0)","v":{"$error":"#N/A"}},{"$f":"MATCH(AB$4,Millwall!$Z88:$AK88,0)","v":1},{"$f":"MATCH(AC$4,Millwall!$Z88:$AK88,0)","v":5},{"$f":"MATCH(AD$4,Millwall!$Z88:$AK88,0)","v":{"$error":"#N/A"}},{"$f":"MATCH(AE$4,Millwall!$Z88:$AK88,0)","v":8},{"$f":"MATCH(AF$4,Millwall!$Z88:$AK88,0)","v":{"$error":"#N/A"}},{"$f":"MATCH(AG$4,Millwall!$Z88:$AK88,0)","v":{"$error":"#N/A"}},{"$f":"MATCH(AH$3,Millwall!$Z88:$AK88,0)","v":{"$error":"#N/A"}},{"$f":"MATCH(AI$3,Millwall!$Z88:$AK88,0)","v":9},{"$f":"MATCH(AJ$3,Millwall!$Z88:$AK88,0)","v":{"$error":"#N/A"}},{"$f":"MATCH(AK$3,Millwall!$Z88:$AK88,0)","v":{"$error":"#N/A"}},{"$f":"MATCH(AL$3,Millwall!$Z88:$AK88,0)","v":{"$error":"#N/A"}},{"$f":"MATCH(AM$3,Millwall!$Z88:$AK88,0)","v":{"$error":"#N/A"}},{"$f":"MATCH(AN$3,Millwall!$Z88:$AK88,0)","v":{"$error":"#N/A"}},{"$f":"MATCH(AO$3,Millwall!$Z88:$AK88,0)","v":{"$error":"#N/A"}},{"$f":"MATCH(AP$3,Millwall!$Z88:$AK88,0)","v":{"$error":"#N/A"}},{"$f":"MATCH(AQ$3,Millwall!$Z88:$AK88,0)","v":{"$error":"#N/A"}},{"$f":"MATCH(AR$3,Millwall!$Z88:$AK88,0)","v":{"$error":"#N/A"}},null,null,null,null,null,{"$f":"MATCH(AX$3,Millwall!$Z88:AK88,0)","v":11},{"$f":"MATCH(AY$3,Millwall!$Z88:AK88,0)","v":{"$error":"#N/A"}},{"$f":"MATCH(AZ$3,Millwall!$Z88:AK88,0)","v":{"$error":"#N/A"}},{"$f":"MATCH(BA$3,Millwall!$Z88:AK88,0)","v":{"$error":"#N/A"}},{"$f":"MATCH(BB$3,Millwall!$Z88:AK88,0)","v":{"$error":"#N/A"}},{"$f":"MATCH(BC$3,Millwall!$Z88:AK88,0)","v":{"$error":"#N/A"}},{"$f":"MATCH(BD$3,Millwall!$Z88:AK88,0)","v":{"$error":"#N/A"}},{"$f":"MATCH(BE$3,Millwall!$Z88:AK88,0)","v":{"$error":"#N/A"}},{"$f":"MATCH(BF$3,Millwall!$Z88:AK88,0)","v":{"$error":"#N/A"}},{"$f":"MATCH(BG$3,Millwall!$Z88:AK88,0)","v":{"$error":"#N/A"}},{"$f":"MATCH(BH$3,Millwall!$Z88:AK88,0)","v":{"$error":"#N/A"}},{"$f":"MATCH(BI$3,Millwall!$Z88:AK88,0)","v":{"$error":"#N/A"}},{"$f":"MATCH(BJ$3,Millwall!$Z88:AK88,0)","v":{"$error":"#N/A"}},{"$f":"MATCH(BK$3,Millwall!$Z88:AK88,0)","v":12},{"$f":"MATCH(BL$3,Millwall!$Z88:AK88,0)","v":{"$error":"#N/A"}},{"$f":"MATCH(BM$3,Millwall!$Z88:AK88,0)","v":{"$error":"#N/A"}},{"$f":"MATCH(BN$3,Millwall!$Z88:AK88,0)","v":{"$error":"#N/A"}},{"$f":"MATCH(BO$3,Millwall!$Z88:AK88,0)","v":{"$error":"#N/A"}},{"$f":"MATCH(BP$3,Millwall!$Z88:AK88,0)","v":{"$error":"#N/A"}},{"$f":"MATCH(BQ$3,Millwall!$Z88:AK88,0)","v":{"$error":"#N/A"}},{"$f":"MATCH(BR$3,Millwall!$Z88:AK88,0)","v":{"$error":"#N/A"}},{"$f":"MATCH(BS$3,Millwall!$Z88:AK88,0)","v":{"$error":"#N/A"}},{"$f":"MATCH(BT$3,Millwall!$Z88:AK88,0)","v":{"$error":"#N/A"}},{"$f":"MATCH(BU$3,Millwall!$Z88:AK88,0)","v":{"$error":"#N/A"}},{"$f":"MATCH(BV$3,Millwall!$Z88:AK88,0)","v":{"$error":"#N/A"}},{"$f":"MATCH(BW$3,Millwall!$Z88:AK88,0)","v":{"$error":"#N/A"}},{"$f":"MATCH(BX$3,Millwall!$Z88:AK88,0)","v":{"$error":"#N/A"}},{"$f":"MATCH(BY$3,Millwall!$Z88:AK88,0)","v":{"$error":"#N/A"}},{"$f":"MATCH(BZ$3,Millwall!$Z88:AK88,0)","v":{"$error":"#N/A"}},{"$f":"MATCH(CA$3,Millwall!$Z88:AK88,0)","v":{"$error":"#N/A"}},{"$f":"MATCH(CB$3,Millwall!$Z88:AK88,0)","v":{"$error":"#N/A"}},{"$f":"MATCH(CC$3,Millwall!$Z88:AK88,0)","v":{"$error":"#N/A"}},{"$f":"MATCH(CD$3,Millwall!$Z88:AK88,0)","v":{"$error":"#N/A"}},{"$f":"MATCH(CE$3,Millwall!$Z88:AK88,0)","v":{"$error":"#N/A"}},null,null,null,null,null,null,null,{"$f":"Millwall!$BN66","v":"Hill"},{"$f":"Millwall!$BN66&\" (**\"","v":"Hill (**"},{"$f":"Millwall!$BN66&\"**\"","v":"Hill**"},null,{"$f":"$CM$18","v":"Hill"},{"$f":"$CN$18","v":"Hill (**"},{"$f":"$CO$18","v":"Hill**"},null,{"$f":"Millwall!$BV$19","v":5}]
[null,null,0,15,null,{"$f":"Millwall!V89","v":"1974-10-26"},null,{"$f":"Millwall!W89","v":"West Brom"},{"$f":"Millwall!X89","v":"(H)"},{"$f":"Millwall!Y89","v":"D 2-2"},{"$f":"MATCH(K$4,Millwall!$Z89:$AK89,0)","v":6},{"$f":"MATCH(L$4,Millwall!$Z89:$AK89,0)","v":{"$error":"#N/A"}},{"$f":"MATCH(M$4,Millwall!$Z89:$AK89,0)","v":10},{"$f":"MATCH(N$4,Millwall!$Z89:$AK89,0)","v":{"$error":"#N/A"}},{"$f":"MATCH(O$4,Millwall!$Z89:$AK89,0)","v":12},{"$f":"MATCH(P$4,Millwall!$Z89:$AK89,0)","v":{"$error":"#N/A"}},{"$f":"MATCH(Q$4,Millwall!$Z89:$AK89,0)","v":8},{"$f":"MATCH(R$4,Millwall!$Z89:$AK89,0)","v":{"$error":"#N/A"}},{"$f":"MATCH(S$4,Millwall!$Z89:$AK89,0)","v":{"$error":"#N/A"}},{"$f":"MATCH(T$4,Millwall!$Z89:$AK89,0)","v":2},{"$f":"MATCH(U$4,Millwall!$Z89:$AK89,0)","v":4},{"$f":"MATCH(V$4,Millwall!$Z89:$AK89,0)","v":{"$error":"#N/A"}},{"$f":"MATCH(W$4,Millwall!$Z89:$AK89,0)","v":{"$error":"#N/A"}},{"$f":"MATCH(X$4,Millwall!$Z89:$AK89,0)","v":11},{"$f":"MATCH(Y$4,Millwall!$Z89:$AK89,0)","v":3},{"$f":"MATCH(Z$4,Millwall!$Z89:$AK89,0)","v":{"$error":"#N/A"}},{"$f":"MATCH(AA$4,Millwall!$Z89:$AK89,0)","v":{"$error":"#N/A"}},{"$f":"MATCH(AB$4,Millwall!$Z89:$AK89,0)","v":1},{"$f":"MATCH(AC$4,Millwall!$Z89:$AK89,0)","v":5},{"$f":"MATCH(AD$4,Millwall!$Z89:$AK89,0)","v":{"$error":"#N/A"}},{"$f":"MATCH(AE$4,Millwall!$Z89:$AK89,0)","v":7},{"$f":"MATCH(AF$4,Millwall!$Z89:$AK89,0)","v":{"$error":"#N/A"}},{"$f":"MATCH(AG$4,Millwall!$Z89:$AK89,0)","v":{"$error":"#N/A"}},{"$f":"MATCH(AH$3,Millwall!$Z89:$AK89,0)","v":{"$error":"#N/A"}},{"$f":"MATCH(AI$3,Millwall!$Z89:$AK89,0)","v":9},{"$f":"MATCH(AJ$3,Millwall!$Z89:$AK89,0)","v":{"$error":"#N/A"}},{"$f":"MATCH(AK$3,Millwall!$Z89:$AK89,0)","v":{"$error":"#N/A"}},{"$f":"MATCH(AL$3,Millwall!$Z89:$AK89,0)","v":{"$error":"#N/A"}},{"$f":"MATCH(AM$3,Millwall!$Z89:$AK89,0)","v":{"$error":"#N/A"}},{"$f":"MATCH(AN$3,Millwall!$Z89:$AK89,0)","v":{"$error":"#N/A"}},{"$f":"MATCH(AO$3,Millwall!$Z89:$AK89,0)","v":{"$error":"#N/A"}},{"$f":"MATCH(AP$3,Millwall!$Z89:$AK89,0)","v":{"$error":"#N/A"}},{"$f":"MATCH(AQ$3,Millwall!$Z89:$AK89,0)","v":{"$error":"#N/A"}},{"$f":"MATCH(AR$3,Millwall!$Z89:$AK89,0)","v":{"$error":"#N/A"}},null,null,null,null,null,{"$f":"MATCH(AX$3,Millwall!$Z89:AK89,0)","v":{"$error":"#N/A"}},{"$f":"MATCH(AY$3,Millwall!$Z89:AK89,0)","v":{"$error":"#N/A"}},{"$f":"MATCH(AZ$3,Millwall!$Z89:AK89,0)","v":{"$error":"#N/A"}},{"$f":"MATCH(BA$3,Millwall!$Z89:AK89,0)","v":{"$error":"#N/A"}},{"$f":"MATCH(BB$3,Millwall!$Z89:AK89,0)","v":12},{"$f":"MATCH(BC$3,Millwall!$Z89:AK89,0)","v":{"$error":"#N/A"}},{"$f":"MATCH(BD$3,Millwall!$Z89:AK89,0)","v":{"$error":"#N/A"}},{"$f":"MATCH(BE$3,Millwall!$Z89:AK89,0)","v":{"$error":"#N/A"}},{"$f":"MATCH(BF$3,Millwall!$Z89:AK89,0)","v":{"$error":"#N/A"}},{"$f":"MATCH(BG$3,Millwall!$Z89:AK89,0)","v":{"$error":"#N/A"}},{"$f":"MATCH(BH$3,Millwall!$Z89:AK89,0)","v":{"$error":"#N/A"}},{"$f":"MATCH(BI$3,Millwall!$Z89:AK89,0)","v":{"$error":"#N/A"}},{"$f":"MATCH(BJ$3,Millwall!$Z89:AK89,0)","v":{"$error":"#N/A"}},{"$f":"MATCH(BK$3,Millwall!$Z89:AK89,0)","v":11},{"$f":"MATCH(BL$3,Millwall!$Z89:AK89,0)","v":{"$error":"#N/A"}},{"$f":"MATCH(BM$3,Millwall!$Z89:AK89,0)","v":{"$error":"#N/A"}},{"$f":"MATCH(BN$3,Millwall!$Z89:AK89,0)","v":{"$error":"#N/A"}},{"$f":"MATCH(BO$3,Millwall!$Z89:AK89,0)","v":{"$error":"#N/A"}},{"$f":"MATCH(BP$3,Millwall!$Z89:AK89,0)","v":{"$error":"#N/A"}},{"$f":"MATCH(BQ$3,Millwall!$Z89:AK89,0)","v":{"$error":"#N/A"}},{"$f":"MATCH(BR$3,Millwall!$Z89:AK89,0)","v":{"$error":"#N/A"}},{"$f":"MATCH(BS$3,Millwall!$Z89:AK89,0)","v":{"$error":"#N/A"}},{"$f":"MATCH(BT$3,Millwall!$Z89:AK89,0)","v":{"$error":"#N/A"}},{"$f":"MATCH(BU$3,Millwall!$Z89:AK89,0)","v":{"$error":"#N/A"}},{"$f":"MATCH(BV$3,Millwall!$Z89:AK89,0)","v":{"$error":"#N/A"}},{"$f":"MATCH(BW$3,Millwall!$Z89:AK89,0)","v":{"$error":"#N/A"}},{"$f":"MATCH(BX$3,Millwall!$Z89:AK89,0)","v":{"$error":"#N/A"}},{"$f":"MATCH(BY$3,Millwall!$Z89:AK89,0)","v":{"$error":"#N/A"}},{"$f":"MATCH(BZ$3,Millwall!$Z89:AK89,0)","v":{"$error":"#N/A"}},{"$f":"MATCH(CA$3,Millwall!$Z89:AK89,0)","v":{"$error":"#N/A"}},{"$f":"MATCH(CB$3,Millwall!$Z89:AK89,0)","v":{"$error":"#N/A"}},{"$f":"MATCH(CC$3,Millwall!$Z89:AK89,0)","v":{"$error":"#N/A"}},{"$f":"MATCH(CD$3,Millwall!$Z89:AK89,0)","v":{"$error":"#N/A"}},{"$f":"MATCH(CE$3,Millwall!$Z89:AK89,0)","v":{"$error":"#N/A"}},null,null,null,null,null,null,null,{"$f":"Millwall!$BN67","v":"Jones"},{"$f":"Millwall!$BN67&\" (**\"","v":"Jones (**"},{"$f":"Millwall!$BN67&\"**\"","v":"Jones**"},null,{"$f":"$CM$19","v":"Jones"},{"$f":"$CN$19","v":"Jones (**"},{"$f":"$CO$19","v":"Jones**"},null,{"$f":"Millwall!$BV$20","v":0}]
[null,null,0,16,null,{"$f":"Millwall!V90","v":"1974-11-02"},null,{"$f":"Millwall!W90","v":"Oldham"},{"$f":"Millwall!X90","v":"(A)"},{"$f":"Millwall!Y90","v":"D 1-1"},{"$f":"MATCH(K$4,Millwall!$Z90:$AK90,0)","v":7},{"$f":"MATCH(L$4,Millwall!$Z90:$AK90,0)","v":{"$error":"#N/A"}},{"$f":"MATCH(M$4,Millwall!$Z90:$AK90,0)","v":10},{"$f":"MATCH(N$4,Millwall!$Z90:$AK90,0)","v":{"$error":"#N/A"}},{"$f":"MATCH(O$4,Millwall!$Z90:$AK90,0)","v":12},{"$f":"MATCH(P$4,Millwall!$Z90:$AK90,0)","v":{"$error":"#N/A"}},{"$f":"MATCH(Q$4,Millwall!$Z90:$AK90,0)","v":8},{"$f":"MATCH(R$4,Millwall!$Z90:$AK90,0)","v":{"$error":"#N/A"}},{"$f":"MATCH(S$4,Millwall!$Z90:$AK90,0)","v":{"$error":"#N/A"}},{"$f":"MATCH(T$4,Millwall!$Z90:$AK90,0)","v":2},{"$f":"MATCH(U$4,Millwall!$Z90:$AK90,0)","v":4},{"$f":"MATCH(V$4,Millwall!$Z90:$AK90,0)","v":{"$error":"#N/A"}},{"$f":"MATCH(W$4,Millwall!$Z90:$AK90,0)","v":{"$error":"#N/A"}},{"$f":"MATCH(X$4,Millwall!$Z90:$AK90,0)","v":11},{"$f":"MATCH(Y$4,Millwall!$Z90:$AK90,0)","v":3},{"$f":"MATCH(Z$4,Millwall!$Z90:$AK90,0)","v":{"$error":"#N/A"}},{"$f":"MATCH(AA$4,Millwall!$Z90:$AK90,0)","v":{"$error":"#N/A"}},{"$f":"MATCH(AB$4,Millwall!$Z90:$AK90,0)","v":1},{"$f":"MATCH(AC$4,Millwall!$Z90:$AK90,0)","v":5},{"$f":"MATCH(AD$4,Millwall!$Z90:$AK90,0)","v":{"$error":"#N/A"}},{"$f":"MATCH(AE$4,Millwall!$Z90:$AK90,0)","v":6},{"$f":"MATCH(AF$4,Millwall!$Z90:$AK90,0)","v":{"$error":"#N/A"}},{"$f":"MATCH(AG$4,Millwall!$Z90:$AK90,0)","v":{"$error":"#N/A"}},{"$f":"MATCH(AH$3,Millwall!$Z90:$AK90,0)","v":{"$error":"#N/A"}},{"$f":"MATCH(AI$3,Millwall!$Z90:$AK90,0)","v":9},{"$f":"MATCH(AJ$3,Millwall!$Z90:$AK90,0)","v":{"$error":"#N/A"}},{"$f":"MATCH(AK$3,Millwall!$Z90:$AK90,0)","v":{"$error":"#N/A"}},{"$f":"MATCH(AL$3,Millwall!$Z90:$AK90,0)","v":{"$error":"#N/A"}},{"$f":"MATCH(AM$3,Millwall!$Z90:$AK90,0)","v":{"$error":"#N/A"}},{"$f":"MATCH(AN$3,Millwall!$Z90:$AK90,0)","v":{"$error":"#N/A"}},{"$f":"MATCH(AO$3,Millwall!$Z90:$AK90,0)","v":{"$error":"#N/A"}},{"$f":"MATCH(AP$3,Millwall!$Z90:$AK90,0)","v":{"$error":"#N/A"}},{"$f":"MATCH(AQ$3,Millwall!$Z90:$AK90,0)","v":{"$error":"#N/A"}},{"$f":"MATCH(AR$3,Millwall!$Z90:$AK90,0)","v":{"$error":"#N/A"}},null,null,null,null,null,{"$f":"MATCH(AX$3,Millwall!$Z90:AK90,0)","v":{"$error":"#N/A"}},{"$f":"MATCH(AY$3,Millwall!$Z90:AK90,0)","v":{"$error":"#N/A"}},{"$f":"MATCH(AZ$3,Millwall!$Z90:AK90,0)","v":{"$error":"#N/A"}},{"$f":"MATCH(BA$3,Millwall!$Z90:AK90,0)","v":{"$error":"#N/A"}},{"$f":"MATCH(BB$3,Millwall!$Z90:AK90,0)","v":12},{"$f":"MATCH(BC$3,Millwall!$Z90:AK90,0)","v":{"$error":"#N/A"}},{"$f":"MATCH(BD$3,Millwall!$Z90:AK90,0)","v":{"$error":"#N/A"}},{"$f":"MATCH(BE$3,Millwall!$Z90:AK90,0)","v":{"$error":"#N/A"}},{"$f":"MATCH(BF$3,Millwall!$Z90:AK90,0)","v":{"$error":"#N/A"}},{"$f":"MATCH(BG$3,Millwall!$Z90:AK90,0)","v":{"$error":"#N/A"}},{"$f":"MATCH(BH$3,Millwall!$Z90:AK90,0)","v":{"$error":"#N/A"}},{"$f":"MATCH(BI$3,Millwall!$Z90:AK90,0)","v":{"$error":"#N/A"}},{"$f":"MATCH(BJ$3,Millwall!$Z90:AK90,0)","v":{"$error":"#N/A"}},{"$f":"MATCH(BK$3,Millwall!$Z90:AK90,0)","v":11},{"$f":"MATCH(BL$3,Millwall!$Z90:AK90,0)","v":{"$error":"#N/A"}},{"$f":"MATCH(BM$3,Millwall!$Z90:AK90,0)","v":{"$error":"#N/A"}},{"$f":"MATCH(BN$3,Millwall!$Z90:AK90,0)","v":{"$error":"#N/A"}},{"$f":"MATCH(BO$3,Millwall!$Z90:AK90,0)","v":{"$error":"#N/A"}},{"$f":"MATCH(BP$3,Millwall!$Z90:AK90,0)","v":{"$error":"#N/A"}},{"$f":"MATCH(BQ$3,Millwall!$Z90:AK90,0)","v":{"$error":"#N/A"}},{"$f":"MATCH(BR$3,Millwall!$Z90:AK90,0)","v":{"$error":"#N/A"}},{"$f":"MATCH(BS$3,Millwall!$Z90:AK90,0)","v":{"$error":"#N/A"}},{"$f":"MATCH(BT$3,Millwall!$Z90:AK90,0)","v":{"$error":"#N/A"}},{"$f":"MATCH(BU$3,Millwall!$Z90:AK90,0)","v":{"$error":"#N/A"}},{"$f":"MATCH(BV$3,Millwall!$Z90:AK90,0)","v":{"$error":"#N/A"}},{"$f":"MATCH(BW$3,Millwall!$Z90:AK90,0)","v":{"$error":"#N/A"}},{"$f":"MATCH(BX$3,Millwall!$Z90:AK90,0)","v":{"$error":"#N/A"}},{"$f":"MATCH(BY$3,Millwall!$Z90:AK90,0)","v":{"$error":"#N/A"}},{"$f":"MATCH(BZ$3,Millwall!$Z90:AK90,0)","v":{"$error":"#N/A"}},{"$f":"MATCH(CA$3,Millwall!$Z90:AK90,0)","v":{"$error":"#N/A"}},{"$f":"MATCH(CB$3,Millwall!$Z90:AK90,0)","v":{"$error":"#N/A"}},{"$f":"MATCH(CC$3,Millwall!$Z90:AK90,0)","v":{"$error":"#N/A"}},{"$f":"MATCH(CD$3,Millwall!$Z90:AK90,0)","v":{"$error":"#N/A"}},{"$f":"MATCH(CE$3,Millwall!$Z90:AK90,0)","v":{"$error":"#N/A"}},null,null,null,null,null,null,null,{"$f":"Millwall!$BN68","v":"C Kelly"},{"$f":"Millwall!$BN68&\" (**\"","v":"C Kelly (**"},{"$f":"Millwall!$BN68&\"**\"","v":"C Kelly**"},null,{"$f":"$CM$20","v":"C Kelly"},{"$f":"$CN$20","v":"C Kelly (**"},{"$f":"$CO$20","v":"C Kelly**"},null,{"$f":"Millwall!$BV$21","v":0}]
[null,null,0,17,null,{"$f":"Millwall!V91","v":"1974-11-09"},null,{"$f":"Millwall!W91","v":"Bolton"},{"$f":"Millwall!X91","v":"(H)"},{"$f":"Millwall!Y91","v":"D 1-1"},{"$f":"MATCH(K$4,Millwall!$Z91:$AK91,0)","v":6},{"$f":"MATCH(L$4,Millwall!$Z91:$AK91,0)","v":{"$error":"#N/A"}},{"$f":"MATCH(M$4,Millwall!$Z91:$AK91,0)","v":10},{"$f":"MATCH(N$4,Millwall!$Z91:$AK91,0)","v":{"$error":"#N/A"}},{"$f":"MATCH(O$4,Millwall!$Z91:$AK91,0)","v":12},{"$f":"MATCH(P$4,Millwall!$Z91:$AK91,0)","v":{"$error":"#N/A"}},{"$f":"MATCH(Q$4,Millwall!$Z91:$AK91,0)","v":8},{"$f":"MATCH(R$4,Millwall!$Z91:$AK91,0)","v":{"$error":"#N/A"}},{"$f":"MATCH(S$4,Millwall!$Z91:$AK91,0)","v":{"$error":"#N/A"}},{"$f":"MATCH(T$4,Millwall!$Z91:$AK91,0)","v":2},{"$f":"MATCH(U$4,Millwall!$Z91:$AK91,0)","v":4},{"$f":"MATCH(V$4,Millwall!$Z91:$AK91,0)","v":{"$error":"#N/A"}},{"$f":"MATCH(W$4,Millwall!$Z91:$AK91,0)","v":{"$error":"#N/A"}},{"$f":"MATCH(X$4,Millwall!$Z91:$AK91,0)","v":11},{"$f":"MATCH(Y$4,Millwall!$Z91:$AK91,0)","v":3},{"$f":"MATCH(Z$4,Millwall!$Z91:$AK91,0)","v":{"$error":"#N/A"}},{"$f":"MATCH(AA$4,Millwall!$Z91:$AK91,0)","v":{"$error":"#N/A"}},{"$f":"MATCH(AB$4,Millwall!$Z91:$AK91,0)","v":1},{"$f":"MATCH(AC$4,Millwall!$Z91:$AK91,0)","v":5},{"$f":"MATCH(AD$4,Millwall!$Z91:$AK91,0)","v":{"$error":"#N/A"}},{"$f":"MATCH(AE$4,Millwall!$Z91:$AK91,0)","v":7},{"$f":"MATCH(AF$4,Millwall!$Z91:$AK91,0)","v":{"$error":"#N/A"}},{"$f":"MATCH(AG$4,Millwall!$Z91:$AK91,0)","v":{"$error":"#N/A"}},{"$f":"MATCH(AH$3,Millwall!$Z91:$AK91,0)","v":{"$error":"#N/A"}},{"$f":"MATCH(AI$3,Millwall!$Z91:$AK91,0)","v":9},{"$f":"MATCH(AJ$3,Millwall!$Z91:$AK91,0)","v":{"$error":"#N/A"}},{"$f":"MATCH(AK$3,Millwall!$Z91:$AK91,0)","v":{"$error":"#N/A"}},{"$f":"MATCH(AL$3,Millwall!$Z91:$AK91,0)","v":{"$error":"#N/A"}},{"$f":"MATCH(AM$3,Millwall!$Z91:$AK91,0)","v":{"$error":"#N/A"}},{"$f":"MATCH(AN$3,Millwall!$Z91:$AK91,0)","v":{"$error":"#N/A"}},{"$f":"MATCH(AO$3,Millwall!$Z91:$AK91,0)","v":{"$error":"#N/A"}},{"$f":"MATCH(AP$3,Millwall!$Z91:$AK91,0)","v":{"$error":"#N/A"}},{"$f":"MATCH(AQ$3,Millwall!$Z91:$AK91,0)","v":{"$error":"#N/A"}},{"$f":"MATCH(AR$3,Millwall!$Z91:$AK91,0)","v":{"$error":"#N/A"}},null,null,null,null,null,{"$f":"MATCH(AX$3,Millwall!$Z91:AK91,0)","v":{"$error":"#N/A"}},{"$f":"MATCH(AY$3,Millwall!$Z91:AK91,0)","v":{"$error":"#N/A"}},{"$f":"MATCH(AZ$3,Millwall!$Z91:AK91,0)","v":{"$error":"#N/A"}},{"$f":"MATCH(BA$3,Millwall!$Z91:AK91,0)","v":{"$error":"#N/A"}},{"$f":"MATCH(BB$3,Millwall!$Z91:AK91,0)","v":12},{"$f":"MATCH(BC$3,Millwall!$Z91:AK91,0)","v":{"$error":"#N/A"}},{"$f":"MATCH(BD$3,Millwall!$Z91:AK91,0)","v":{"$error":"#N/A"}},{"$f":"MATCH(BE$3,Millwall!$Z91:AK91,0)","v":{"$error":"#N/A"}},{"$f":"MATCH(BF$3,Millwall!$Z91:AK91,0)","v":{"$error":"#N/A"}},{"$f":"MATCH(BG$3,Millwall!$Z91:AK91,0)","v":{"$error":"#N/A"}},{"$f":"MATCH(BH$3,Millwall!$Z91:AK91,0)","v":{"$error":"#N/A"}},{"$f":"MATCH(BI$3,Millwall!$Z91:AK91,0)","v":{"$error":"#N/A"}},{"$f":"MATCH(BJ$3,Millwall!$Z91:AK91,0)","v":{"$error":"#N/A"}},{"$f":"MATCH(BK$3,Millwall!$Z91:AK91,0)","v":11},{"$f":"MATCH(BL$3,Millwall!$Z91:AK91,0)","v":{"$error":"#N/A"}},{"$f":"MATCH(BM$3,Millwall!$Z91:AK91,0)","v":{"$error":"#N/A"}},{"$f":"MATCH(BN$3,Millwall!$Z91:AK91,0)","v":{"$error":"#N/A"}},{"$f":"MATCH(BO$3,Millwall!$Z91:AK91,0)","v":{"$error":"#N/A"}},{"$f":"MATCH(BP$3,Millwall!$Z91:AK91,0)","v":{"$error":"#N/A"}},{"$f":"MATCH(BQ$3,Millwall!$Z91:AK91,0)","v":{"$error":"#N/A"}},{"$f":"MATCH(BR$3,Millwall!$Z91:AK91,0)","v":{"$error":"#N/A"}},{"$f":"MATCH(BS$3,Millwall!$Z91:AK91,0)","v":{"$error":"#N/A"}},{"$f":"MATCH(BT$3,Millwall!$Z91:AK91,0)","v":{"$error":"#N/A"}},{"$f":"MATCH(BU$3,Millwall!$Z91:AK91,0)","v":{"$error":"#N/A"}},{"$f":"MATCH(BV$3,Millwall!$Z91:AK91,0)","v":{"$error":"#N/A"}},{"$f":"MATCH(BW$3,Millwall!$Z91:AK91,0)","v":{"$error":"#N/A"}},{"$f":"MATCH(BX$3,Millwall!$Z91:AK91,0)","v":{"$error":"#N/A"}},{"$f":"MATCH(BY$3,Millwall!$Z91:AK91,0)","v":{"$error":"#N/A"}},{"$f":"MATCH(BZ$3,Millwall!$Z91:AK91,0)","v":{"$error":"#N/A"}},{"$f":"MATCH(CA$3,Millwall!$Z91:AK91,0)","v":{"$error":"#N/A"}},{"$f":"MATCH(CB$3,Millwall!$Z91:AK91,0)","v":{"$error":"#N/A"}},{"$f":"MATCH(CC$3,Millwall!$Z91:AK91,0)","v":{"$error":"#N/A"}},{"$f":"MATCH(CD$3,Millwall!$Z91:AK91,0)","v":{"$error":"#N/A"}},{"$f":"MATCH(CE$3,Millwall!$Z91:AK91,0)","v":{"$error":"#N/A"}},null,null,null,null,null,null,null,{"$f":"Millwall!$BN69","v":"M Kelly"},{"$f":"Millwall!$BN69&\" (**\"","v":"M Kelly (**"},{"$f":"Millwall!$BN69&\"**\"","v":"M Kelly**"},null,{"$f":"$CM$21","v":"M Kelly"},{"$f":"$CN$21","v":"M Kelly (**"},{"$f":"$CO$21","v":"M Kelly**"},null,{"$f":"Millwall!$BV$22","v":1}]
[null,null,0,18,null,{"$f":"Millwall!V92","v":"1974-11-16"},null,{"$f":"Millwall!W92","v":"York"},{"$f":"Millwall!X92","v":"(A)"},{"$f":"Millwall!Y92","v":"L 1-2"},{"$f":"MATCH(K$4,Millwall!$Z92:$AK92,0)","v":6},{"$f":"MATCH(L$4,Millwall!$Z92:$AK92,0)","v":{"$error":"#N/A"}},{"$f":"MATCH(M$4,Millwall!$Z92:$AK92,0)","v":10},{"$f":"MATCH(N$4,Millwall!$Z92:$AK92,0)","v":{"$error":"#N/A"}},{"$f":"MATCH(O$4,Millwall!$Z92:$AK92,0)","v":9},{"$f":"MATCH(P$4,Millwall!$Z92:$AK92,0)","v":{"$error":"#N/A"}},{"$f":"MATCH(Q$4,Millwall!$Z92:$AK92,0)","v":8},{"$f":"MATCH(R$4,Millwall!$Z92:$AK92,0)","v":{"$error":"#N/A"}},{"$f":"MATCH(S$4,Millwall!$Z92:$AK92,0)","v":{"$error":"#N/A"}},{"$f":"MATCH(T$4,Millwall!$Z92:$AK92,0)","v":2},{"$f":"MATCH(U$4,Millwall!$Z92:$AK92,0)","v":4},{"$f":"MATCH(V$4,Millwall!$Z92:$AK92,0)","v":{"$error":"#N/A"}},{"$f":"MATCH(W$4,Millwall!$Z92:$AK92,0)","v":{"$error":"#N/A"}},{"$f":"MATCH(X$4,Millwall!$Z92:$AK92,0)","v":11},{"$f":"MATCH(Y$4,Millwall!$Z92:$AK92,0)","v":3},{"$f":"MATCH(Z$4,Millwall!$Z92:$AK92,0)","v":{"$error":"#N/A"}},{"$f":"MATCH(AA$4,Millwall!$Z92:$AK92,0)","v":{"$error":"#N/A"}},{"$f":"MATCH(AB$4,Millwall!$Z92:$AK92,0)","v":1},{"$f":"MATCH(AC$4,Millwall!$Z92:$AK92,0)","v":5},{"$f":"MATCH(AD$4,Millwall!$Z92:$AK92,0)","v":{"$error":"#N/A"}},{"$f":"MATCH(AE$4,Millwall!$Z92:$AK92,0)","v":7},{"$f":"MATCH(AF$4,Millwall!$Z92:$AK92,0)","v":{"$error":"#N/A"}},{"$f":"MATCH(AG$4,Millwall!$Z92:$AK92,0)","v":{"$error":"#N/A"}},{"$f":"MATCH(AH$3,Millwall!$Z92:$AK92,0)","v":{"$error":"#N/A"}},{"$f":"MATCH(AI$3,Millwall!$Z92:$AK92,0)","v":{"$error":"#N/A"}},{"$f":"MATCH(AJ$3,Millwall!$Z92:$AK92,0)","v":{"$error":"#N/A"}},{"$f":"MATCH(AK$3,Millwall!$Z92:$AK92,0)","v":{"$error":"#N/A"}},{"$f":"MATCH(AL$3,Millwall!$Z92:$AK92,0)","v":{"$error":"#N/A"}},{"$f":"MATCH(AM$3,Millwall!$Z92:$AK92,0)","v":{"$error":"#N/A"}},{"$f":"MATCH(AN$3,Millwall!$Z92:$AK92,0)","v":{"$error":"#N/A"}},{"$f":"MATCH(AO$3,Millwall!$Z92:$AK92,0)","v":{"$error":"#N/A"}},{"$f":"MATCH(AP$3,Millwall!$Z92:$AK92,0)","v":{"$error":"#N/A"}},{"$f":"MATCH(AQ$3,Millwall!$Z92:$AK92,0)","v":{"$error":"#N/A"}},{"$f":"MATCH(AR$3,Millwall!$Z92:$AK92,0)","v":{"$error":"#N/A"}},null,null,null,null,null,{"$f":"MATCH(AX$3,Millwall!$Z92:AK92,0)","v":{"$error":"#N/A"}},{"$f":"MATCH(AY$3,Millwall!$Z92:AK92,0)","v":{"$error":"#N/A"}},{"$f":"MATCH(AZ$3,Millwall!$Z92:AK92,0)","v":{"$error":"#N/A"}},{"$f":"MATCH(BA$3,Millwall!$Z92:AK92,0)","v":{"$error":"#N/A"}},{"$f":"MATCH(BB$3,Millwall!$Z92:AK92,0)","v":{"$error":"#N/A"}},{"$f":"MATCH(BC$3,Millwall!$Z92:AK92,0)","v":{"$error":"#N/A"}},{"$f":"MATCH(BD$3,Millwall!$Z92:AK92,0)","v":{"$error":"#N/A"}},{"$f":"MATCH(BE$3,Millwall!$Z92:AK92,0)","v":{"$error":"#N/A"}},{"$f":"MATCH(BF$3,Millwall!$Z92:AK92,0)","v":{"$error":"#N/A"}},{"$f":"MATCH(BG$3,Millwall!$Z92:AK92,0)","v":{"$error":"#N/A"}},{"$f":"MATCH(BH$3,Millwall!$Z92:AK92,0)","v":{"$error":"#N/A"}},{"$f":"MATCH(BI$3,Millwall!$Z92:AK92,0)","v":{"$error":"#N/A"}},{"$f":"MATCH(BJ$3,Millwall!$Z92:AK92,0)","v":{"$error":"#N/A"}},{"$f":"MATCH(BK$3,Millwall!$Z92:AK92,0)","v":{"$error":"#N/A"}},{"$f":"MATCH(BL$3,Millwall!$Z92:AK92,0)","v":{"$error":"#N/A"}},{"$f":"MATCH(BM$3,Millwall!$Z92:AK92,0)","v":{"$error":"#N/A"}},{"$f":"MATCH(BN$3,Millwall!$Z92:AK92,0)","v":{"$error":"#N/A"}},{"$f":"MATCH(BO$3,Millwall!$Z92:AK92,0)","v":{"$error":"#N/A"}},{"$f":"MATCH(BP$3,Millwall!$Z92:AK92,0)","v":{"$error":"#N/A"}},{"$f":"MATCH(BQ$3,Millwall!$Z92:AK92,0)","v":{"$error":"#N/A"}},{"$f":"MATCH(BR$3,Millwall!$Z92:AK92,0)","v":{"$error":"#N/A"}},{"$f":"MATCH(BS$3,Millwall!$Z92:AK92,0)","v":{"$error":"#N/A"}},{"$f":"MATCH(BT$3,Millwall!$Z92:AK92,0)","v":{"$error":"#N/A"}},{"$f":"MATCH(BU$3,Millwall!$Z92:AK92,0)","v":{"$error":"#N/A"}},{"$f":"MATCH(BV$3,Millwall!$Z92:AK92,0)","v":{"$error":"#N/A"}},{"$f":"MATCH(BW$3,Millwall!$Z92:AK92,0)","v":{"$error":"#N/A"}},{"$f":"MATCH(BX$3,Millwall!$Z92:AK92,0)","v":{"$error":"#N/A"}},{"$f":"MATCH(BY$3,Millwall!$Z92:AK92,0)","v":{"$error":"#N/A"}},{"$f":"MATCH(BZ$3,Millwall!$Z92:AK92,0)","v":{"$error":"#N/A"}},{"$f":"MATCH(CA$3,Millwall!$Z92:AK92,0)","v":{"$error":"#N/A"}},{"$f":"MATCH(CB$3,Millwall!$Z92:AK92,0)","v":{"$error":"#N/A"}},{"$f":"MATCH(CC$3,Millwall!$Z92:AK92,0)","v":{"$error":"#N/A"}},{"$f":"MATCH(CD$3,Millwall!$Z92:AK92,0)","v":{"$error":"#N/A"}},{"$f":"MATCH(CE$3,Millwall!$Z92:AK92,0)","v":{"$error":"#N/A"}},null,null,null,null,null,null,null,{"$f":"Millwall!$BN70","v":"King"},{"$f":"Millwall!$BN70&\" (**\"","v":"King (**"},{"$f":"Millwall!$BN70&\"**\"","v":"King**"},null,{"$f":"$CM$22","v":"King"},{"$f":"$CN$22","v":"King (**"},{"$f":"$CO$22","v":"King**"},null,{"$f":"Millwall!$BV$23","v":0}]
[null,null,0,19,null,{"$f":"Millwall!V93","v":"1974-11-30"},null,{"$f":"Millwall!W93","v":"Notts Co"},{"$f":"Millwall!X93","v":"(A)"},{"$f":"Millwall!Y93","v":"L 1-2"},{"$f":"MATCH(K$4,Millwall!$Z93:$AK93,0)","v":6},{"$f":"MATCH(L$4,Millwall!$Z93:$AK93,0)","v":9},{"$f":"MATCH(M$4,Millwall!$Z93:$AK93,0)","v":10},{"$f":"MATCH(N$4,Millwall!$Z93:$AK93,0)","v":{"$error":"#N/A"}},{"$f":"MATCH(O$4,Millwall!$Z93:$AK93,0)","v":{"$error":"#N/A"}},{"$f":"MATCH(P$4,Millwall!$Z93:$AK93,0)","v":{"$error":"#N/A"}},{"$f":"MATCH(Q$4,Millwall!$Z93:$AK93,0)","v":12},{"$f":"MATCH(R$4,Millwall!$Z93:$AK93,0)","v":{"$error":"#N/A"}},{"$f":"MATCH(S$4,Millwall!$Z93:$AK93,0)","v":{"$error":"#N/A"}},{"$f":"MATCH(T$4,Millwall!$Z93:$AK93,0)","v":2},{"$f":"MATCH(U$4,Millwall!$Z93:$AK93,0)","v":4},{"$f":"MATCH(V$4,Millwall!$Z93:$AK93,0)","v":{"$error":"#N/A"}},{"$f":"MATCH(W$4,Millwall!$Z93:$AK93,0)","v":{"$error":"#N/A"}},{"$f":"MATCH(X$4,Millwall!$Z93:$AK93,0)","v":11},{"$f":"MATCH(Y$4,Millwall!$Z93:$AK93,0)","v":3},{"$f":"MATCH(Z$4,Millwall!$Z93:$AK93,0)","v":{"$error":"#N/A"}},{"$f":"MATCH(AA$4,Millwall!$Z93:$AK93,0)","v":{"$error":"#N/A"}},{"$f":"MATCH(AB$4,Millwall!$Z93:$AK93,0)","v":1},{"$f":"MATCH(AC$4,Millwall!$Z93:$AK93,0)","v":5},{"$f":"MATCH(AD$4,Millwall!$Z93:$AK93,0)","v":{"$error":"#N/A"}},{"$f":"MATCH(AE$4,Millwall!$Z93:$AK93,0)","v":7},{"$f":"MATCH(AF$4,Millwall!$Z93:$AK93,0)","v":{"$error":"#N/A"}},{"$f":"MATCH(AG$4,Millwall!$Z93:$AK93,0)","v":{"$error":"#N/A"}},{"$f":"MATCH(AH$3,Millwall!$Z93:$AK93,0)","v":8},{"$f":"MATCH(AI$3,Millwall!$Z93:$AK93,0)","v":{"$error":"#N/A"}},{"$f":"MATCH(AJ$3,Millwall!$Z93:$AK93,0)","v":{"$error":"#N/A"}},{"$f":"MATCH(AK$3,Millwall!$Z93:$AK93,0)","v":{"$error":"#N/A"}},{"$f":"MATCH(AL$3,Millwall!$Z93:$AK93,0)","v":{"$error":"#N/A"}},{"$f":"MATCH(AM$3,Millwall!$Z93:$AK93,0)","v":{"$error":"#N/A"}},{"$f":"MATCH(AN$3,Millwall!$Z93:$AK93,0)","v":{"$error":"#N/A"}},{"$f":"MATCH(AO$3,Millwall!$Z93:$AK93,0)","v":{"$error":"#N/A"}},{"$f":"MATCH(AP$3,Millwall!$Z93:$AK93,0)","v":{"$error":"#N/A"}},{"$f":"MATCH(AQ$3,Millwall!$Z93:$AK93,0)","v":{"$error":"#N/A"}},{"$f":"MATCH(AR$3,Millwall!$Z93:$AK93,0)","v":{"$error":"#N/A"}},null,null,null,null,null,{"$f":"MATCH(AX$3,Millwall!$Z93:AK93,0)","v":{"$error":"#N/A"}},{"$f":"MATCH(AY$3,Millwall!$Z93:AK93,0)","v":{"$error":"#N/A"}},{"$f":"MATCH(AZ$3,Millwall!$Z93:AK93,0)","v":{"$error":"#N/A"}},{"$f":"MATCH(BA$3,Millwall!$Z93:AK93,0)","v":{"$error":"#N/A"}},{"$f":"MATCH(BB$3,Millwall!$Z93:AK93,0)","v":{"$error":"#N/A"}},{"$f":"MATCH(BC$3,Millwall!$Z93:AK93,0)","v":{"$error":"#N/A"}},{"$f":"MATCH(BD$3,Millwall!$Z93:AK93,0)","v":12},{"$f":"MATCH(BE$3,Millwall!$Z93:AK93,0)","v":{"$error":"#N/A"}},{"$f":"MATCH(BF$3,Millwall!$Z93:AK93,0)","v":{"$error":"#N/A"}},{"$f":"MATCH(BG$3,Millwall!$Z93:AK93,0)","v":2},{"$f":"MATCH(BH$3,Millwall!$Z93:AK93,0)","v":{"$error":"#N/A"}},{"$f":"MATCH(BI$3,Millwall!$Z93:AK93,0)","v":{"$error":"#N/A"}},{"$f":"MATCH(BJ$3,Millwall!$Z93:AK93,0)","v":{"$error":"#N/A"}},{"$f":"MATCH(BK$3,Millwall!$Z93:AK93,0)","v":{"$error":"#N/A"}},{"$f":"MATCH(BL$3,Millwall!$Z93:AK93,0)","v":{"$error":"#N/A"}},{"$f":"MATCH(BM$3,Millwall!$Z93:AK93,0)","v":{"$error":"#N/A"}},{"$f":"MATCH(BN$3,Millwall!$Z93:AK93,0)","v":{"$error":"#N/A"}},{"$f":"MATCH(BO$3,Millwall!$Z93:AK93,0)","v":{"$error":"#N/A"}},{"$f":"MATCH(BP$3,Millwall!$Z93:AK93,0)","v":{"$error":"#N/A"}},{"$f":"MATCH(BQ$3,Millwall!$Z93:AK93,0)","v":{"$error":"#N/A"}},{"$f":"MATCH(BR$3,Millwall!$Z93:AK93,0)","v":{"$error":"#N/A"}},{"$f":"MATCH(BS$3,Millwall!$Z93:AK93,0)","v":{"$error":"#N/A"}},{"$f":"MATCH(BT$3,Millwall!$Z93:AK93,0)","v":{"$error":"#N/A"}},{"$f":"MATCH(BU$3,Millwall!$Z93:AK93,0)","v":{"$error":"#N/A"}},{"$f":"MATCH(BV$3,Millwall!$Z93:AK93,0)","v":{"$error":"#N/A"}},{"$f":"MATCH(BW$3,Millwall!$Z93:AK93,0)","v":{"$error":"#N/A"}},{"$f":"MATCH(BX$3,Millwall!$Z93:AK93,0)","v":{"$error":"#N/A"}},{"$f":"MATCH(BY$3,Millwall!$Z93:AK93,0)","v":{"$error":"#N/A"}},{"$f":"MATCH(BZ$3,Millwall!$Z93:AK93,0)","v":{"$error":"#N/A"}},{"$f":"MATCH(CA$3,Millwall!$Z93:AK93,0)","v":{"$error":"#N/A"}},{"$f":"MATCH(CB$3,Millwall!$Z93:AK93,0)","v":{"$error":"#N/A"}},{"$f":"MATCH(CC$3,Millwall!$Z93:AK93,0)","v":{"$error":"#N/A"}},{"$f":"MATCH(CD$3,Millwall!$Z93:AK93,0)","v":{"$error":"#N/A"}},{"$f":"MATCH(CE$3,Millwall!$Z93:AK93,0)","v":{"$error":"#N/A"}},null,null,null,null,null,null,null,{"$f":"Millwall!$BN71","v":"Kitchener"},{"$f":"Millwall!$BN71&\" (**\"","v":"Kitchener (**"},{"$f":"Millwall!$BN71&\"**\"","v":"Kitchener**"},null,{"$f":"$CM$23","v":"Kitchener"},{"$f":"$CN$23","v":"Kitchener (**"},{"$f":"$CO$23","v":"Kitchener**"},null,{"$f":"Millwall!$BV$24","v":2}]
[null,null,0,20,null,{"$f":"Millwall!V94","v":"1974-12-07"},null,{"$f":"Millwall!W94","v":"Orient"},{"$f":"Millwall!X94","v":"(H)"},{"$f":"Millwall!Y94","v":"D 1-1"},{"$f":"MATCH(K$4,Millwall!$Z94:$AK94,0)","v":10},{"$f":"MATCH(L$4,Millwall!$Z94:$AK94,0)","v":9},{"$f":"MATCH(M$4,Millwall!$Z94:$AK94,0)","v":7},{"$f":"MATCH(N$4,Millwall!$Z94:$AK94,0)","v":{"$error":"#N/A"}},{"$f":"MATCH(O$4,Millwall!$Z94:$AK94,0)","v":{"$error":"#N/A"}},{"$f":"MATCH(P$4,Millwall!$Z94:$AK94,0)","v":{"$error":"#N/A"}},{"$f":"MATCH(Q$4,Millwall!$Z94:$AK94,0)","v":{"$error":"#N/A"}},{"$f":"MATCH(R$4,Millwall!$Z94:$AK94,0)","v":{"$error":"#N/A"}},{"$f":"MATCH(S$4,Millwall!$Z94:$AK94,0)","v":5},{"$f":"MATCH(T$4,Millwall!$Z94:$AK94,0)","v":2},{"$f":"MATCH(U$4,Millwall!$Z94:$AK94,0)","v":4},{"$f":"MATCH(V$4,Millwall!$Z94:$AK94,0)","v":{"$error":"#N/A"}},{"$f":"MATCH(W$4,Millwall!$Z94:$AK94,0)","v":{"$error":"#N/A"}},{"$f":"MATCH(X$4,Millwall!$Z94:$AK94,0)","v":11},{"$f":"MATCH(Y$4,Millwall!$Z94:$AK94,0)","v":3},{"$f":"MATCH(Z$4,Millwall!$Z94:$AK94,0)","v":{"$error":"#N/A"}},{"$f":"MATCH(AA$4,Millwall!$Z94:$AK94,0)","v":{"$error":"#N/A"}},{"$f":"MATCH(AB$4,Millwall!$Z94:$AK94,0)","v":1},{"$f":"MATCH(AC$4,Millwall!$Z94:$AK94,0)","v":{"$error":"#N/A"}},{"$f":"MATCH(AD$4,Millwall!$Z94:$AK94,0)","v":{"$error":"#N/A"}},{"$f":"MATCH(AE$4,Millwall!$Z94:$AK94,0)","v":6},{"$f":"MATCH(AF$4,Millwall!$Z94:$AK94,0)","v":{"$error":"#N/A"}},{"$f":"MATCH(AG$4,Millwall!$Z94:$AK94,0)","v":{"$error":"#N/A"}},{"$f":"MATCH(AH$3,Millwall!$Z94:$AK94,0)","v":8},{"$f":"MATCH(AI$3,Millwall!$Z94:$AK94,0)","v":{"$error":"#N/A"}},{"$f":"MATCH(AJ$3,Millwall!$Z94:$AK94,0)","v":{"$error":"#N/A"}},{"$f":"MATCH(AK$3,Millwall!$Z94:$AK94,0)","v":{"$error":"#N/A"}},{"$f":"MATCH(AL$3,Millwall!$Z94:$AK94,0)","v":{"$error":"#N/A"}},{"$f":"MATCH(AM$3,Millwall!$Z94:$AK94,0)","v":{"$error":"#N/A"}},{"$f":"MATCH(AN$3,Millwall!$Z94:$AK94,0)","v":{"$error":"#N/A"}},{"$f":"MATCH(AO$3,Millwall!$Z94:$AK94,0)","v":{"$error":"#N/A"}},{"$f":"MATCH(AP$3,Millwall!$Z94:$AK94,0)","v":{"$error":"#N/A"}},{"$f":"MATCH(AQ$3,Millwall!$Z94:$AK94,0)","v":{"$error":"#N/A"}},{"$f":"MATCH(AR$3,Millwall!$Z94:$AK94,0)","v":{"$error":"#N/A"}},null,null,null,null,null,{"$f":"MATCH(AX$3,Millwall!$Z94:AK94,0)","v":{"$error":"#N/A"}},{"$f":"MATCH(AY$3,Millwall!$Z94:AK94,0)","v":{"$error":"#N/A"}},{"$f":"MATCH(AZ$3,Millwall!$Z94:AK94,0)","v":{"$error":"#N/A"}},{"$f":"MATCH(BA$3,Millwall!$Z94:AK94,0)","v":{"$error":"#N/A"}},{"$f":"MATCH(BB$3,Millwall!$Z94:AK94,0)","v":{"$error":"#N/A"}},{"$f":"MATCH(BC$3,Millwall!$Z94:AK94,0)","v":{"$error":"#N/A"}},{"$f":"MATCH(BD$3,Millwall!$Z94:AK94,0)","v":{"$error":"#N/A"}},{"$f":"MATCH(BE$3,Millwall!$Z94:AK94,0)","v":{"$error":"#N/A"}},{"$f":"MATCH(BF$3,Millwall!$Z94:AK94,0)","v":{"$error":"#N/A"}},{"$f":"MATCH(BG$3,Millwall!$Z94:AK94,0)","v":{"$error":"#N/A"}},{"$f":"MATCH(BH$3,Millwall!$Z94:AK94,0)","v":{"$error":"#N/A"}},{"$f":"MATCH(BI$3,Millwall!$Z94:AK94,0)","v":{"$error":"#N/A"}},{"$f":"MATCH(BJ$3,Millwall!$Z94:AK94,0)","v":{"$error":"#N/A"}},{"$f":"MATCH(BK$3,Millwall!$Z94:AK94,0)","v":{"$error":"#N/A"}},{"$f":"MATCH(BL$3,Millwall!$Z94:AK94,0)","v":{"$error":"#N/A"}},{"$f":"MATCH(BM$3,Millwall!$Z94:AK94,0)","v":{"$error":"#N/A"}},{"$f":"MATCH(BN$3,Millwall!$Z94:AK94,0)","v":{"$error":"#N/A"}},{"$f":"MATCH(BO$3,Millwall!$Z94:AK94,0)","v":{"$error":"#N/A"}},{"$f":"MATCH(BP$3,Millwall!$Z94:AK94,0)","v":{"$error":"#N/A"}},{"$f":"MATCH(BQ$3,Millwall!$Z94:AK94,0)","v":{"$error":"#N/A"}},{"$f":"MATCH(BR$3,Millwall!$Z94:AK94,0)","v":{"$error":"#N/A"}},{"$f":"MATCH(BS$3,Millwall!$Z94:AK94,0)","v":{"$error":"#N/A"}},{"$f":"MATCH(BT$3,Millwall!$Z94:AK94,0)","v":{"$error":"#N/A"}},{"$f":"MATCH(BU$3,Millwall!$Z94:AK94,0)","v":{"$error":"#N/A"}},{"$f":"MATCH(BV$3,Millwall!$Z94:AK94,0)","v":{"$error":"#N/A"}},{"$f":"MATCH(BW$3,Millwall!$Z94:AK94,0)","v":{"$error":"#N/A"}},{"$f":"MATCH(BX$3,Millwall!$Z94:AK94,0)","v":{"$error":"#N/A"}},{"$f":"MATCH(BY$3,Millwall!$Z94:AK94,0)","v":{"$error":"#N/A"}},{"$f":"MATCH(BZ$3,Millwall!$Z94:AK94,0)","v":{"$error":"#N/A"}},{"$f":"MATCH(CA$3,Millwall!$Z94:AK94,0)","v":{"$error":"#N/A"}},{"$f":"MATCH(CB$3,Millwall!$Z94:AK94,0)","v":{"$error":"#N/A"}},{"$f":"MATCH(CC$3,Millwall!$Z94:AK94,0)","v":{"$error":"#N/A"}},{"$f":"MATCH(CD$3,Millwall!$Z94:AK94,0)","v":{"$error":"#N/A"}},{"$f":"MATCH(CE$3,Millwall!$Z94:AK94,0)","v":{"$error":"#N/A"}},null,null,null,null,null,null,null,{"$f":"Millwall!$BN72","v":"Moore"},{"$f":"Millwall!$BN72&\" (**\"","v":"Moore (**"},{"$f":"Millwall!$BN72&\"**\"","v":"Moore**"},null,{"$f":"$CM$24","v":"Moore"},{"$f":"$CN$24","v":"Moore (**"},{"$f":"$CO$24","v":"Moore**"},null,{"$f":"Millwall!$BV$25","v":2}]
[null,null,0,21,null,{"$f":"Millwall!V95","v":"1974-12-14"},null,{"$f":"Millwall!W95","v":"Sunderland"},{"$f":"Millwall!X95","v":"(A)"},{"$f":"Millwall!Y95","v":"L 0-2"},{"$f":"MATCH(K$4,Millwall!$Z95:$AK95,0)","v":10},{"$f":"MATCH(L$4,Millwall!$Z95:$AK95,0)","v":9},{"$f":"MATCH(M$4,Millwall!$Z95:$AK95,0)","v":7},{"$f":"MATCH(N$4,Millwall!$Z95:$AK95,0)","v":{"$error":"#N/A"}},{"$f":"MATCH(O$4,Millwall!$Z95:$AK95,0)","v":{"$error":"#N/A"}},{"$f":"MATCH(P$4,Millwall!$Z95:$AK95,0)","v":{"$error":"#N/A"}},{"$f":"MATCH(Q$4,Millwall!$Z95:$AK95,0)","v":12},{"$f":"MATCH(R$4,Millwall!$Z95:$AK95,0)","v":{"$error":"#N/A"}},{"$f":"MATCH(S$4,Millwall!$Z95:$AK95,0)","v":4},{"$f":"MATCH(T$4,Millwall!$Z95:$AK95,0)","v":2},{"$f":"MATCH(U$4,Millwall!$Z95:$AK95,0)","v":5},{"$f":"MATCH(V$4,Millwall!$Z95:$AK95,0)","v":{"$error":"#N/A"}},{"$f":"MATCH(W$4,Millwall!$Z95:$AK95,0)","v":{"$error":"#N/A"}},{"$f":"MATCH(X$4,Millwall!$Z95:$AK95,0)","v":11},{"$f":"MATCH(Y$4,Millwall!$Z95:$AK95,0)","v":{"$error":"#N/A"}},{"$f":"MATCH(Z$4,Millwall!$Z95:$AK95,0)","v":{"$error":"#N/A"}},{"$f":"MATCH(AA$4,Millwall!$Z95:$AK95,0)","v":{"$error":"#N/A"}},{"$f":"MATCH(AB$4,Millwall!$Z95:$AK95,0)","v":1},{"$f":"MATCH(AC$4,Millwall!$Z95:$AK95,0)","v":{"$error":"#N/A"}},{"$f":"MATCH(AD$4,Millwall!$Z95:$AK95,0)","v":3},{"$f":"MATCH(AE$4,Millwall!$Z95:$AK95,0)","v":6},{"$f":"MATCH(AF$4,Millwall!$Z95:$AK95,0)","v":{"$error":"#N/A"}},{"$f":"MATCH(AG$4,Millwall!$Z95:$AK95,0)","v":{"$error":"#N/A"}},{"$f":"MATCH(AH$3,Millwall!$Z95:$AK95,0)","v":8},{"$f":"MATCH(AI$3,Millwall!$Z95:$AK95,0)","v":{"$error":"#N/A"}},{"$f":"MATCH(AJ$3,Millwall!$Z95:$AK95,0)","v":{"$error":"#N/A"}},{"$f":"MATCH(AK$3,Millwall!$Z95:$AK95,0)","v":{"$error":"#N/A"}},{"$f":"MATCH(AL$3,Millwall!$Z95:$AK95,0)","v":{"$error":"#N/A"}},{"$f":"MATCH(AM$3,Millwall!$Z95:$AK95,0)","v":{"$error":"#N/A"}},{"$f":"MATCH(AN$3,Millwall!$Z95:$AK95,0)","v":{"$error":"#N/A"}},{"$f":"MATCH(AO$3,Millwall!$Z95:$AK95,0)","v":{"$error":"#N/A"}},{"$f":"MATCH(AP$3,Millwall!$Z95:$AK95,0)","v":{"$error":"#N/A"}},{"$f":"MATCH(AQ$3,Millwall!$Z95:$AK95,0)","v":{"$error":"#N/A"}},{"$f":"MATCH(AR$3,Millwall!$Z95:$AK95,0)","v":{"$error":"#N/A"}},null,null,null,null,null,{"$f":"MATCH(AX$3,Millwall!$Z95:AK95,0)","v":10},{"$f":"MATCH(AY$3,Millwall!$Z95:AK95,0)","v":{"$error":"#N/A"}},{"$f":"MATCH(AZ$3,Millwall!$Z95:AK95,0)","v":{"$error":"#N/A"}},{"$f":"MATCH(BA$3,Millwall!$Z95:AK95,0)","v":{"$error":"#N/A"}},{"$f":"MATCH(BB$3,Millwall!$Z95:AK95,0)","v":{"$error":"#N/A"}},{"$f":"MATCH(BC$3,Millwall!$Z95:AK95,0)","v":{"$error":"#N/A"}},{"$f":"MATCH(BD$3,Millwall!$Z95:AK95,0)","v":12},{"$f":"MATCH(BE$3,Millwall!$Z95:AK95,0)","v":{"$error":"#N/A"}},{"$f":"MATCH(BF$3,Millwall!$Z95:AK95,0)","v":{"$error":"#N/A"}},{"$f":"MATCH(BG$3,Millwall!$Z95:AK95,0)","v":{"$error":"#N/A"}},{"$f":"MATCH(BH$3,Millwall!$Z95:AK95,0)","v":{"$error":"#N/A"}},{"$f":"MATCH(BI$3,Millwall!$Z95:AK95,0)","v":{"$error":"#N/A"}},{"$f":"MATCH(BJ$3,Millwall!$Z95:AK95,0)","v":{"$error":"#N/A"}},{"$f":"MATCH(BK$3,Millwall!$Z95:AK95,0)","v":{"$error":"#N/A"}},{"$f":"MATCH(BL$3,Millwall!$Z95:AK95,0)","v":{"$error":"#N/A"}},{"$f":"MATCH(BM$3,Millwall!$Z95:AK95,0)","v":{"$error":"#N/A"}},{"$f":"MATCH(BN$3,Millwall!$Z95:AK95,0)","v":{"$error":"#N/A"}},{"$f":"MATCH(BO$3,Millwall!$Z95:AK95,0)","v":{"$error":"#N/A"}},{"$f":"MATCH(BP$3,Millwall!$Z95:AK95,0)","v":{"$error":"#N/A"}},{"$f":"MATCH(BQ$3,Millwall!$Z95:AK95,0)","v":{"$error":"#N/A"}},{"$f":"MATCH(BR$3,Millwall!$Z95:AK95,0)","v":{"$error":"#N/A"}},{"$f":"MATCH(BS$3,Millwall!$Z95:AK95,0)","v":{"$error":"#N/A"}},{"$f":"MATCH(BT$3,Millwall!$Z95:AK95,0)","v":{"$error":"#N/A"}},{"$f":"MATCH(BU$3,Millwall!$Z95:AK95,0)","v":{"$error":"#N/A"}},{"$f":"MATCH(BV$3,Millwall!$Z95:AK95,0)","v":{"$error":"#N/A"}},{"$f":"MATCH(BW$3,Millwall!$Z95:AK95,0)","v":{"$error":"#N/A"}},{"$f":"MATCH(BX$3,Millwall!$Z95:AK95,0)","v":{"$error":"#N/A"}},{"$f":"MATCH(BY$3,Millwall!$Z95:AK95,0)","v":{"$error":"#N/A"}},{"$f":"MATCH(BZ$3,Millwall!$Z95:AK95,0)","v":{"$error":"#N/A"}},{"$f":"MATCH(CA$3,Millwall!$Z95:AK95,0)","v":{"$error":"#N/A"}},{"$f":"MATCH(CB$3,Millwall!$Z95:AK95,0)","v":{"$error":"#N/A"}},{"$f":"MATCH(CC$3,Millwall!$Z95:AK95,0)","v":{"$error":"#N/A"}},{"$f":"MATCH(CD$3,Millwall!$Z95:AK95,0)","v":{"$error":"#N/A"}},{"$f":"MATCH(CE$3,Millwall!$Z95:AK95,0)","v":{"$error":"#N/A"}},null,null,null,null,null,null,null,{"$f":"Millwall!$BN73","v":"Saul"},{"$f":"Millwall!$BN73&\" (**\"","v":"Saul (**"},{"$f":"Millwall!$BN73&\"**\"","v":"Saul**"},null,{"$f":"$CM$25","v":"Saul"},{"$f":"$CN$25","v":"Saul (**"},{"$f":"$CO$25","v":"Saul**"},null,{"$f":"Millwall!$BV$26","v":2}]
[null,null,0,22,null,{"$f":"Millwall!V96","v":"1974-12-21"},null,{"$f":"Millwall!W96","v":"Sheff Wed"},{"$f":"Millwall!X96","v":"(H)"},{"$f":"Millwall!Y96","v":"W 2-1"},{"$f":"MATCH(K$4,Millwall!$Z96:$AK96,0)","v":10},{"$f":"MATCH(L$4,Millwall!$Z96:$AK96,0)","v":9},{"$f":"MATCH(M$4,Millwall!$Z96:$AK96,0)","v":7},{"$f":"MATCH(N$4,Millwall!$Z96:$AK96,0)","v":{"$error":"#N/A"}},{"$f":"MATCH(O$4,Millwall!$Z96:$AK96,0)","v":{"$error":"#N/A"}},{"$f":"MATCH(P$4,Millwall!$Z96:$AK96,0)","v":{"$error":"#N/A"}},{"$f":"MATCH(Q$4,Millwall!$Z96:$AK96,0)","v":{"$error":"#N/A"}},{"$f":"MATCH(R$4,Millwall!$Z96:$AK96,0)","v":{"$error":"#N/A"}},{"$f":"MATCH(S$4,Millwall!$Z96:$AK96,0)","v":11},{"$f":"MATCH(T$4,Millwall!$Z96:$AK96,0)","v":{"$error":"#N/A"}},{"$f":"MATCH(U$4,Millwall!$Z96:$AK96,0)","v":4},{"$f":"MATCH(V$4,Millwall!$Z96:$AK96,0)","v":{"$error":"#N/A"}},{"$f":"MATCH(W$4,Millwall!$Z96:$AK96,0)","v":2},{"$f":"MATCH(X$4,Millwall!$Z96:$AK96,0)","v":{"$error":"#N/A"}},{"$f":"MATCH(Y$4,Millwall!$Z96:$AK96,0)","v":{"$error":"#N/A"}},{"$f":"MATCH(Z$4,Millwall!$Z96:$AK96,0)","v":{"$error":"#N/A"}},{"$f":"MATCH(AA$4,Millwall!$Z96:$AK96,0)","v":{"$error":"#N/A"}},{"$f":"MATCH(AB$4,Millwall!$Z96:$AK96,0)","v":1},{"$f":"MATCH(AC$4,Millwall!$Z96:$AK96,0)","v":5},{"$f":"MATCH(AD$4,Millwall!$Z96:$AK96,0)","v":3},{"$f":"MATCH(AE$4,Millwall!$Z96:$AK96,0)","v":6},{"$f":"MATCH(AF$4,Millwall!$Z96:$AK96,0)","v":{"$error":"#N/A"}},{"$f":"MATCH(AG$4,Millwall!$Z96:$AK96,0)","v":{"$error":"#N/A"}},{"$f":"MATCH(AH$3,Millwall!$Z96:$AK96,0)","v":8},{"$f":"MATCH(AI$3,Millwall!$Z96:$AK96,0)","v":{"$error":"#N/A"}},{"$f":"MATCH(AJ$3,Millwall!$Z96:$AK96,0)","v":{"$error":"#N/A"}},{"$f":"MATCH(AK$3,Millwall!$Z96:$AK96,0)","v":{"$error":"#N/A"}},{"$f":"MATCH(AL$3,Millwall!$Z96:$AK96,0)","v":{"$error":"#N/A"}},{"$f":"MATCH(AM$3,Millwall!$Z96:$AK96,0)","v":{"$error":"#N/A"}},{"$f":"MATCH(AN$3,Millwall!$Z96:$AK96,0)","v":{"$error":"#N/A"}},{"$f":"MATCH(AO$3,Millwall!$Z96:$AK96,0)","v":{"$error":"#N/A"}},{"$f":"MATCH(AP$3,Millwall!$Z96:$AK96,0)","v":{"$error":"#N/A"}},{"$f":"MATCH(AQ$3,Millwall!$Z96:$AK96,0)","v":{"$error":"#N/A"}},{"$f":"MATCH(AR$3,Millwall!$Z96:$AK96,0)","v":{"$error":"#N/A"}},null,null,null,null,null,{"$f":"MATCH(AX$3,Millwall!$Z96:AK96,0)","v":{"$error":"#N/A"}},{"$f":"MATCH(AY$3,Millwall!$Z96:AK96,0)","v":{"$error":"#N/A"}},{"$f":"MATCH(AZ$3,Millwall!$Z96:AK96,0)","v":{"$error":"#N/A"}},{"$f":"MATCH(BA$3,Millwall!$Z96:AK96,0)","v":{"$error":"#N/A"}},{"$f":"MATCH(BB$3,Millwall!$Z96:AK96,0)","v":{"$error":"#N/A"}},{"$f":"MATCH(BC$3,Millwall!$Z96:AK96,0)","v":{"$error":"#N/A"}},{"$f":"MATCH(BD$3,Millwall!$Z96:AK96,0)","v":{"$error":"#N/A"}},{"$f":"MATCH(BE$3,Millwall!$Z96:AK96,0)","v":{"$error":"#N/A"}},{"$f":"MATCH(BF$3,Millwall!$Z96:AK96,0)","v":{"$error":"#N/A"}},{"$f":"MATCH(BG$3,Millwall!$Z96:AK96,0)","v":{"$error":"#N/A"}},{"$f":"MATCH(BH$3,Millwall!$Z96:AK96,0)","v":{"$error":"#N/A"}},{"$f":"MATCH(BI$3,Millwall!$Z96:AK96,0)","v":{"$error":"#N/A"}},{"$f":"MATCH(BJ$3,Millwall!$Z96:AK96,0)","v":{"$error":"#N/A"}},{"$f":"MATCH(BK$3,Millwall!$Z96:AK96,0)","v":{"$error":"#N/A"}},{"$f":"MATCH(BL$3,Millwall!$Z96:AK96,0)","v":{"$error":"#N/A"}},{"$f":"MATCH(BM$3,Millwall!$Z96:AK96,0)","v":{"$error":"#N/A"}},{"$f":"MATCH(BN$3,Millwall!$Z96:AK96,0)","v":{"$error":"#N/A"}},{"$f":"MATCH(BO$3,Millwall!$Z96:AK96,0)","v":{"$error":"#N/A"}},{"$f":"MATCH(BP$3,Millwall!$Z96:AK96,0)","v":{"$error":"#N/A"}},{"$f":"MATCH(BQ$3,Millwall!$Z96:AK96,0)","v":{"$error":"#N/A"}},{"$f":"MATCH(BR$3,Millwall!$Z96:AK96,0)","v":{"$error":"#N/A"}},{"$f":"MATCH(BS$3,Millwall!$Z96:AK96,0)","v":{"$error":"#N/A"}},{"$f":"MATCH(BT$3,Millwall!$Z96:AK96,0)","v":{"$error":"#N/A"}},{"$f":"MATCH(BU$3,Millwall!$Z96:AK96,0)","v":{"$error":"#N/A"}},{"$f":"MATCH(BV$3,Millwall!$Z96:AK96,0)","v":{"$error":"#N/A"}},{"$f":"MATCH(BW$3,Millwall!$Z96:AK96,0)","v":{"$error":"#N/A"}},{"$f":"MATCH(BX$3,Millwall!$Z96:AK96,0)","v":{"$error":"#N/A"}},{"$f":"MATCH(BY$3,Millwall!$Z96:AK96,0)","v":{"$error":"#N/A"}},{"$f":"MATCH(BZ$3,Millwall!$Z96:AK96,0)","v":{"$error":"#N/A"}},{"$f":"MATCH(CA$3,Millwall!$Z96:AK96,0)","v":{"$error":"#N/A"}},{"$f":"MATCH(CB$3,Millwall!$Z96:AK96,0)","v":{"$error":"#N/A"}},{"$f":"MATCH(CC$3,Millwall!$Z96:AK96,0)","v":{"$error":"#N/A"}},{"$f":"MATCH(CD$3,Millwall!$Z96:AK96,0)","v":{"$error":"#N/A"}},{"$f":"MATCH(CE$3,Millwall!$Z96:AK96,0)","v":{"$error":"#N/A"}},null,null,null,null,null,null,null,{"$f":"Millwall!$BN74","v":"Smethurst"},{"$f":"Millwall!$BN74&\" (**\"","v":"Smethurst (**"},{"$f":"Millwall!$BN74&\"**\"","v":"Smethurst**"},null,{"$f":"$CM$26","v":"Smethurst"},{"$f":"$CN$26","v":"Smethurst (**"},{"$f":"$CO$26","v":"Smethurst**"},null,{"$f":"Millwall!$BV$27","v":1}]
[null,null,0,23,null,{"$f":"Millwall!V97","v":"1974-12-26"},null,{"$f":"Millwall!W97","v":"Oxford"},{"$f":"Millwall!X97","v":"(A)"},{"$f":"Millwall!Y97","v":"L 1-3"},{"$f":"MATCH(K$4,Millwall!$Z97:$AK97,0)","v":{"$error":"#N/A"}},{"$f":"MATCH(L$4,Millwall!$Z97:$AK97,0)","v":9},{"$f":"MATCH(M$4,Millwall!$Z97:$AK97,0)","v":{"$error":"#N/A"}},{"$f":"MATCH(N$4,Millwall!$Z97:$AK97,0)","v":{"$error":"#N/A"}},{"$f":"MATCH(O$4,Millwall!$Z97:$AK97,0)","v":{"$error":"#N/A"}},{"$f":"MATCH(P$4,Millwall!$Z97:$AK97,0)","v":{"$error":"#N/A"}},{"$f":"MATCH(Q$4,Millwall!$Z97:$AK97,0)","v":{"$error":"#N/A"}},{"$f":"MATCH(R$4,Millwall!$Z97:$AK97,0)","v":{"$error":"#N/A"}},{"$f":"MATCH(S$4,Millwall!$Z97:$AK97,0)","v":10},{"$f":"MATCH(T$4,Millwall!$Z97:$AK97,0)","v":2},{"$f":"MATCH(U$4,Millwall!$Z97:$AK97,0)","v":4},{"$f":"MATCH(V$4,Millwall!$Z97:$AK97,0)","v":{"$error":"#N/A"}},{"$f":"MATCH(W$4,Millwall!$Z97:$AK97,0)","v":7},{"$f":"MATCH(X$4,Millwall!$Z97:$AK97,0)","v":11},{"$f":"MATCH(Y$4,Millwall!$Z97:$AK97,0)","v":{"$error":"#N/A"}},{"$f":"MATCH(Z$4,Millwall!$Z97:$AK97,0)","v":{"$error":"#N/A"}},{"$f":"MATCH(AA$4,Millwall!$Z97:$AK97,0)","v":{"$error":"#N/A"}},{"$f":"MATCH(AB$4,Millwall!$Z97:$AK97,0)","v":1},{"$f":"MATCH(AC$4,Millwall!$Z97:$AK97,0)","v":5},{"$f":"MATCH(AD$4,Millwall!$Z97:$AK97,0)","v":3},{"$f":"MATCH(AE$4,Millwall!$Z97:$AK97,0)","v":6},{"$f":"MATCH(AF$4,Millwall!$Z97:$AK97,0)","v":{"$error":"#N/A"}},{"$f":"MATCH(AG$4,Millwall!$Z97:$AK97,0)","v":{"$error":"#N/A"}},{"$f":"MATCH(AH$3,Millwall!$Z97:$AK97,0)","v":8},{"$f":"MATCH(AI$3,Millwall!$Z97:$AK97,0)","v":{"$error":"#N/A"}},{"$f":"MATCH(AJ$3,Millwall!$Z97:$AK97,0)","v":{"$error":"#N/A"}},{"$f":"MATCH(AK$3,Millwall!$Z97:$AK97,0)","v":{"$error":"#N/A"}},{"$f":"MATCH(AL$3,Millwall!$Z97:$AK97,0)","v":{"$error":"#N/A"}},{"$f":"MATCH(AM$3,Millwall!$Z97:$AK97,0)","v":{"$error":"#N/A"}},{"$f":"MATCH(AN$3,Millwall!$Z97:$AK97,0)","v":{"$error":"#N/A"}},{"$f":"MATCH(AO$3,Millwall!$Z97:$AK97,0)","v":{"$error":"#N/A"}},{"$f":"MATCH(AP$3,Millwall!$Z97:$AK97,0)","v":{"$error":"#N/A"}},{"$f":"MATCH(AQ$3,Millwall!$Z97:$AK97,0)","v":{"$error":"#N/A"}},{"$f":"MATCH(AR$3,Millwall!$Z97:$AK97,0)","v":{"$error":"#N/A"}},null,null,null,null,null,{"$f":"MATCH(AX$3,Millwall!$Z97:AK97,0)","v":{"$error":"#N/A"}},{"$f":"MATCH(AY$3,Millwall!$Z97:AK97,0)","v":{"$error":"#N/A"}},{"$f":"MATCH(AZ$3,Millwall!$Z97:AK97,0)","v":{"$error":"#N/A"}},{"$f":"MATCH(BA$3,Millwall!$Z97:AK97,0)","v":{"$error":"#N/A"}},{"$f":"MATCH(BB$3,Millwall!$Z97:AK97,0)","v":{"$error":"#N/A"}},{"$f":"MATCH(BC$3,Millwall!$Z97:AK97,0)","v":{"$error":"#N/A"}},{"$f":"MATCH(BD$3,Millwall!$Z97:AK97,0)","v":{"$error":"#N/A"}},{"$f":"MATCH(BE$3,Millwall!$Z97:AK97,0)","v":{"$error":"#N/A"}},{"$f":"MATCH(BF$3,Millwall!$Z97:AK97,0)","v":{"$error":"#N/A"}},{"$f":"MATCH(BG$3,Millwall!$Z97:AK97,0)","v":{"$error":"#N/A"}},{"$f":"MATCH(BH$3,Millwall!$Z97:AK97,0)","v":{"$error":"#N/A"}},{"$f":"MATCH(BI$3,Millwall!$Z97:AK97,0)","v":{"$error":"#N/A"}},{"$f":"MATCH(BJ$3,Millwall!$Z97:AK97,0)","v":{"$error":"#N/A"}},{"$f":"MATCH(BK$3,Millwall!$Z97:AK97,0)","v":{"$error":"#N/A"}},{"$f":"MATCH(BL$3,Millwall!$Z97:AK97,0)","v":{"$error":"#N/A"}},{"$f":"MATCH(BM$3,Millwall!$Z97:AK97,0)","v":{"$error":"#N/A"}},{"$f":"MATCH(BN$3,Millwall!$Z97:AK97,0)","v":{"$error":"#N/A"}},{"$f":"MATCH(BO$3,Millwall!$Z97:AK97,0)","v":{"$error":"#N/A"}},{"$f":"MATCH(BP$3,Millwall!$Z97:AK97,0)","v":{"$error":"#N/A"}},{"$f":"MATCH(BQ$3,Millwall!$Z97:AK97,0)","v":{"$error":"#N/A"}},{"$f":"MATCH(BR$3,Millwall!$Z97:AK97,0)","v":{"$error":"#N/A"}},{"$f":"MATCH(BS$3,Millwall!$Z97:AK97,0)","v":{"$error":"#N/A"}},{"$f":"MATCH(BT$3,Millwall!$Z97:AK97,0)","v":{"$error":"#N/A"}},{"$f":"MATCH(BU$3,Millwall!$Z97:AK97,0)","v":{"$error":"#N/A"}},{"$f":"MATCH(BV$3,Millwall!$Z97:AK97,0)","v":{"$error":"#N/A"}},{"$f":"MATCH(BW$3,Millwall!$Z97:AK97,0)","v":{"$error":"#N/A"}},{"$f":"MATCH(BX$3,Millwall!$Z97:AK97,0)","v":{"$error":"#N/A"}},{"$f":"MATCH(BY$3,Millwall!$Z97:AK97,0)","v":{"$error":"#N/A"}},{"$f":"MATCH(BZ$3,Millwall!$Z97:AK97,0)","v":{"$error":"#N/A"}},{"$f":"MATCH(CA$3,Millwall!$Z97:AK97,0)","v":{"$error":"#N/A"}},{"$f":"MATCH(CB$3,Millwall!$Z97:AK97,0)","v":{"$error":"#N/A"}},{"$f":"MATCH(CC$3,Millwall!$Z97:AK97,0)","v":{"$error":"#N/A"}},{"$f":"MATCH(CD$3,Millwall!$Z97:AK97,0)","v":{"$error":"#N/A"}},{"$f":"MATCH(CE$3,Millwall!$Z97:AK97,0)","v":{"$error":"#N/A"}},null,null,null,null,null,null,null,{"$f":"Millwall!$BN75","v":"Smith"},{"$f":"Millwall!$BN75&\" (**\"","v":"Smith (**"},{"$f":"Millwall!$BN75&\"**\"","v":"Smith**"},null,{"$f":"$CM$27","v":"Smith"},{"$f":"$CN$27","v":"Smith (**"},{"$f":"$CO$27","v":"Smith**"},null,{"$f":"Millwall!$BV$28","v":0}]
[null,null,0,24,null,{"$f":"Millwall!V98","v":"1974-12-28"},null,{"$f":"Millwall!W98","v":"Portsmouth"},{"$f":"Millwall!X98","v":"(H)"},{"$f":"Millwall!Y98","v":"D 0-0"},{"$f":"MATCH(K$4,Millwall!$Z98:$AK98,0)","v":12},{"$f":"MATCH(L$4,Millwall!$Z98:$AK98,0)","v":9},{"$f":"MATCH(M$4,Millwall!$Z98:$AK98,0)","v":{"$error":"#N/A"}},{"$f":"MATCH(N$4,Millwall!$Z98:$AK98,0)","v":{"$error":"#N/A"}},{"$f":"MATCH(O$4,Millwall!$Z98:$AK98,0)","v":{"$error":"#N/A"}},{"$f":"MATCH(P$4,Millwall!$Z98:$AK98,0)","v":{"$error":"#N/A"}},{"$f":"MATCH(Q$4,Millwall!$Z98:$AK98,0)","v":10},{"$f":"MATCH(R$4,Millwall!$Z98:$AK98,0)","v":{"$error":"#N/A"}},{"$f":"MATCH(S$4,Millwall!$Z98:$AK98,0)","v":{"$error":"#N/A"}},{"$f":"MATCH(T$4,Millwall!$Z98:$AK98,0)","v":4},{"$f":"MATCH(U$4,Millwall!$Z98:$AK98,0)","v":6},{"$f":"MATCH(V$4,Millwall!$Z98:$AK98,0)","v":{"$error":"#N/A"}},{"$f":"MATCH(W$4,Millwall!$Z98:$AK98,0)","v":2},{"$f":"MATCH(X$4,Millwall!$Z98:$AK98,0)","v":11},{"$f":"MATCH(Y$4,Millwall!$Z98:$AK98,0)","v":{"$error":"#N/A"}},{"$f":"MATCH(Z$4,Millwall!$Z98:$AK98,0)","v":{"$error":"#N/A"}},{"$f":"MATCH(AA$4,Millwall!$Z98:$AK98,0)","v":{"$error":"#N/A"}},{"$f":"MATCH(AB$4,Millwall!$Z98:$AK98,0)","v":1},{"$f":"MATCH(AC$4,Millwall!$Z98:$AK98,0)","v":5},{"$f":"MATCH(AD$4,Millwall!$Z98:$AK98,0)","v":3},{"$f":"MATCH(AE$4,Millwall!$Z98:$AK98,0)","v":7},{"$f":"MATCH(AF$4,Millwall!$Z98:$AK98,0)","v":{"$error":"#N/A"}},{"$f":"MATCH(AG$4,Millwall!$Z98:$AK98,0)","v":{"$error":"#N/A"}},{"$f":"MATCH(AH$3,Millwall!$Z98:$AK98,0)","v":{"$error":"#N/A"}},{"$f":"MATCH(AI$3,Millwall!$Z98:$AK98,0)","v":{"$error":"#N/A"}},{"$f":"MATCH(AJ$3,Millwall!$Z98:$AK98,0)","v":{"$error":"#N/A"}},{"$f":"MATCH(AK$3,Millwall!$Z98:$AK98,0)","v":{"$error":"#N/A"}},{"$f":"MATCH(AL$3,Millwall!$Z98:$AK98,0)","v":{"$error":"#N/A"}},{"$f":"MATCH(AM$3,Millwall!$Z98:$AK98,0)","v":{"$error":"#N/A"}},{"$f":"MATCH(AN$3,Millwall!$Z98:$AK98,0)","v":{"$error":"#N/A"}},{"$f":"MATCH(AO$3,Millwall!$Z98:$AK98,0)","v":{"$error":"#N/A"}},{"$f":"MATCH(AP$3,Millwall!$Z98:$AK98,0)","v":{"$error":"#N/A"}},{"$f":"MATCH(AQ$3,Millwall!$Z98:$AK98,0)","v":{"$error":"#N/A"}},{"$f":"MATCH(AR$3,Millwall!$Z98:$AK98,0)","v":{"$error":"#N/A"}},null,null,null,null,null,{"$f":"MATCH(AX$3,Millwall!$Z98:AK98,0)","v":12},{"$f":"MATCH(AY$3,Millwall!$Z98:AK98,0)","v":{"$error":"#N/A"}},{"$f":"MATCH(AZ$3,Millwall!$Z98:AK98,0)","v":{"$error":"#N/A"}},{"$f":"MATCH(BA$3,Millwall!$Z98:AK98,0)","v":{"$error":"#N/A"}},{"$f":"MATCH(BB$3,Millwall!$Z98:AK98,0)","v":{"$error":"#N/A"}},{"$f":"MATCH(BC$3,Millwall!$Z98:AK98,0)","v":{"$error":"#N/A"}},{"$f":"MATCH(BD$3,Millwall!$Z98:AK98,0)","v":{"$error":"#N/A"}},{"$f":"MATCH(BE$3,Millwall!$Z98:AK98,0)","v":{"$error":"#N/A"}},{"$f":"MATCH(BF$3,Millwall!$Z98:AK98,0)","v":{"$error":"#N/A"}},{"$f":"MATCH(BG$3,Millwall!$Z98:AK98,0)","v":{"$error":"#N/A"}},{"$f":"MATCH(BH$3,Millwall!$Z98:AK98,0)","v":{"$error":"#N/A"}},{"$f":"MATCH(BI$3,Millwall!$Z98:AK98,0)","v":{"$error":"#N/A"}},{"$f":"MATCH(BJ$3,Millwall!$Z98:AK98,0)","v":{"$error":"#N/A"}},{"$f":"MATCH(BK$3,Millwall!$Z98:AK98,0)","v":{"$error":"#N/A"}},{"$f":"MATCH(BL$3,Millwall!$Z98:AK98,0)","v":{"$error":"#N/A"}},{"$f":"MATCH(BM$3,Millwall!$Z98:AK98,0)","v":{"$error":"#N/A"}},{"$f":"MATCH(BN$3,Millwall!$Z98:AK98,0)","v":{"$error":"#N/A"}},{"$f":"MATCH(BO$3,Millwall!$Z98:AK98,0)","v":{"$error":"#N/A"}},{"$f":"MATCH(BP$3,Millwall!$Z98:AK98,0)","v":{"$error":"#N/A"}},{"$f":"MATCH(BQ$3,Millwall!$Z98:AK98,0)","v":{"$error":"#N/A"}},{"$f":"MATCH(BR$3,Millwall!$Z98:AK98,0)","v":{"$error":"#N/A"}},{"$f":"MATCH(BS$3,Millwall!$Z98:AK98,0)","v":{"$error":"#N/A"}},{"$f":"MATCH(BT$3,Millwall!$Z98:AK98,0)","v":{"$error":"#N/A"}},{"$f":"MATCH(BU$3,Millwall!$Z98:AK98,0)","v":8},{"$f":"MATCH(BV$3,Millwall!$Z98:AK98,0)","v":{"$error":"#N/A"}},{"$f":"MATCH(BW$3,Millwall!$Z98:AK98,0)","v":{"$error":"#N/A"}},{"$f":"MATCH(BX$3,Millwall!$Z98:AK98,0)","v":{"$error":"#N/A"}},{"$f":"MATCH(BY$3,Millwall!$Z98:AK98,0)","v":{"$error":"#N/A"}},{"$f":"MATCH(BZ$3,Millwall!$Z98:AK98,0)","v":{"$error":"#N/A"}},{"$f":"MATCH(CA$3,Millwall!$Z98:AK98,0)","v":{"$error":"#N/A"}},{"$f":"MATCH(CB$3,Millwall!$Z98:AK98,0)","v":{"$error":"#N/A"}},{"$f":"MATCH(CC$3,Millwall!$Z98:AK98,0)","v":{"$error":"#N/A"}},{"$f":"MATCH(CD$3,Millwall!$Z98:AK98,0)","v":{"$error":"#N/A"}},{"$f":"MATCH(CE$3,Millwall!$Z98:AK98,0)","v":{"$error":"#N/A"}},null,null,null,null,null,null,null,{"$f":"Millwall!$BN76","v":"Summerill"},{"$f":"Millwall!$BN76&\" (**\"","v":"Summerill (**"},{"$f":"Millwall!$BN76&\"**\"","v":"Summerill**"},null,{"$f":"$CM$28","v":"Summerill"},{"$f":"$CN$28","v":"Summerill (**"},{"$f":"$CO$28","v":"Summerill**"},null,{"$f":"Millwall!$BV$29","v":6}]
[null,null,0,25,null,{"$f":"Millwall!V99","v":"1975-01-11"},null,{"$f":"Millwall!W99","v":"Orient"},{"$f":"Millwall!X99","v":"(A)"},{"$f":"Millwall!Y99","v":"L 1-2"},{"$f":"MATCH(K$4,Millwall!$Z99:$AK99,0)","v":12},{"$f":"MATCH(L$4,Millwall!$Z99:$AK99,0)","v":{"$error":"#N/A"}},{"$f":"MATCH(M$4,Millwall!$Z99:$AK99,0)","v":8},{"$f":"MATCH(N$4,Millwall!$Z99:$AK99,0)","v":{"$error":"#N/A"}},{"$f":"MATCH(O$4,Millwall!$Z99:$AK99,0)","v":{"$error":"#N/A"}},{"$f":"MATCH(P$4,Millwall!$Z99:$AK99,0)","v":{"$error":"#N/A"}},{"$f":"MATCH(Q$4,Millwall!$Z99:$AK99,0)","v":9},{"$f":"MATCH(R$4,Millwall!$Z99:$AK99,0)","v":{"$error":"#N/A"}},{"$f":"MATCH(S$4,Millwall!$Z99:$AK99,0)","v":{"$error":"#N/A"}},{"$f":"MATCH(T$4,Millwall!$Z99:$AK99,0)","v":2},{"$f":"MATCH(U$4,Millwall!$Z99:$AK99,0)","v":4},{"$f":"MATCH(V$4,Millwall!$Z99:$AK99,0)","v":{"$error":"#N/A"}},{"$f":"MATCH(W$4,Millwall!$Z99:$AK99,0)","v":7},{"$f":"MATCH(X$4,Millwall!$Z99:$AK99,0)","v":11},{"$f":"MATCH(Y$4,Millwall!$Z99:$AK99,0)","v":{"$error":"#N/A"}},{"$f":"MATCH(Z$4,Millwall!$Z99:$AK99,0)","v":{"$error":"#N/A"}},{"$f":"MATCH(AA$4,Millwall!$Z99:$AK99,0)","v":{"$error":"#N/A"}},{"$f":"MATCH(AB$4,Millwall!$Z99:$AK99,0)","v":1},{"$f":"MATCH(AC$4,Millwall!$Z99:$AK99,0)","v":5},{"$f":"MATCH(AD$4,Millwall!$Z99:$AK99,0)","v":3},{"$f":"MATCH(AE$4,Millwall!$Z99:$AK99,0)","v":6},{"$f":"MATCH(AF$4,Millwall!$Z99:$AK99,0)","v":{"$error":"#N/A"}},{"$f":"MATCH(AG$4,Millwall!$Z99:$AK99,0)","v":{"$error":"#N/A"}},{"$f":"MATCH(AH$3,Millwall!$Z99:$AK99,0)","v":10},{"$f":"MATCH(AI$3,Millwall!$Z99:$AK99,0)","v":{"$error":"#N/A"}},{"$f":"MATCH(AJ$3,Millwall!$Z99:$AK99,0)","v":{"$error":"#N/A"}},{"$f":"MATCH(AK$3,Millwall!$Z99:$AK99,0)","v":{"$error":"#N/A"}},{"$f":"MATCH(AL$3,Millwall!$Z99:$AK99,0)","v":{"$error":"#N/A"}},{"$f":"MATCH(AM$3,Millwall!$Z99:$AK99,0)","v":{"$error":"#N/A"}},{"$f":"MATCH(AN$3,Millwall!$Z99:$AK99,0)","v":{"$error":"#N/A"}},{"$f":"MATCH(AO$3,Millwall!$Z99:$AK99,0)","v":{"$error":"#N/A"}},{"$f":"MATCH(AP$3,Millwall!$Z99:$AK99,0)","v":{"$error":"#N/A"}},{"$f":"MATCH(AQ$3,Millwall!$Z99:$AK99,0)","v":{"$error":"#N/A"}},{"$f":"MATCH(AR$3,Millwall!$Z99:$AK99,0)","v":{"$error":"#N/A"}},null,null,null,null,null,{"$f":"MATCH(AX$3,Millwall!$Z99:AK99,0)","v":12},{"$f":"MATCH(AY$3,Millwall!$Z99:AK99,0)","v":{"$error":"#N/A"}},{"$f":"MATCH(AZ$3,Millwall!$Z99:AK99,0)","v":8},{"$f":"MATCH(BA$3,Millwall!$Z99:AK99,0)","v":{"$error":"#N/A"}},{"$f":"MATCH(BB$3,Millwall!$Z99:AK99,0)","v":{"$error":"#N/A"}},{"$f":"MATCH(BC$3,Millwall!$Z99:AK99,0)","v":{"$error":"#N/A"}},{"$f":"MATCH(BD$3,Millwall!$Z99:AK99,0)","v":{"$error":"#N/A"}},{"$f":"MATCH(BE$3,Millwall!$Z99:AK99,0)","v":{"$error":"#N/A"}},{"$f":"MATCH(BF$3,Millwall!$Z99:AK99,0)","v":{"$error":"#N/A"}},{"$f":"MATCH(BG$3,Millwall!$Z99:AK99,0)","v":{"$error":"#N/A"}},{"$f":"MATCH(BH$3,Millwall!$Z99:AK99,0)","v":{"$error":"#N/A"}},{"$f":"MATCH(BI$3,Millwall!$Z99:AK99,0)","v":{"$error":"#N/A"}},{"$f":"MATCH(BJ$3,Millwall!$Z99:AK99,0)","v":{"$error":"#N/A"}},{"$f":"MATCH(BK$3,Millwall!$Z99:AK99,0)","v":{"$error":"#N/A"}},{"$f":"MATCH(BL$3,Millwall!$Z99:AK99,0)","v":{"$error":"#N/A"}},{"$f":"MATCH(BM$3,Millwall!$Z99:AK99,0)","v":{"$error":"#N/A"}},{"$f":"MATCH(BN$3,Millwall!$Z99:AK99,0)","v":{"$error":"#N/A"}},{"$f":"MATCH(BO$3,Millwall!$Z99:AK99,0)","v":{"$error":"#N/A"}},{"$f":"MATCH(BP$3,Millwall!$Z99:AK99,0)","v":{"$error":"#N/A"}},{"$f":"MATCH(BQ$3,Millwall!$Z99:AK99,0)","v":{"$error":"#N/A"}},{"$f":"MATCH(BR$3,Millwall!$Z99:AK99,0)","v":{"$error":"#N/A"}},{"$f":"MATCH(BS$3,Millwall!$Z99:AK99,0)","v":{"$error":"#N/A"}},{"$f":"MATCH(BT$3,Millwall!$Z99:AK99,0)","v":{"$error":"#N/A"}},{"$f":"MATCH(BU$3,Millwall!$Z99:AK99,0)","v":{"$error":"#N/A"}},{"$f":"MATCH(BV$3,Millwall!$Z99:AK99,0)","v":{"$error":"#N/A"}},{"$f":"MATCH(BW$3,Millwall!$Z99:AK99,0)","v":{"$error":"#N/A"}},{"$f":"MATCH(BX$3,Millwall!$Z99:AK99,0)","v":{"$error":"#N/A"}},{"$f":"MATCH(BY$3,Millwall!$Z99:AK99,0)","v":{"$error":"#N/A"}},{"$f":"MATCH(BZ$3,Millwall!$Z99:AK99,0)","v":{"$error":"#N/A"}},{"$f":"MATCH(CA$3,Millwall!$Z99:AK99,0)","v":{"$error":"#N/A"}},{"$f":"MATCH(CB$3,Millwall!$Z99:AK99,0)","v":{"$error":"#N/A"}},{"$f":"MATCH(CC$3,Millwall!$Z99:AK99,0)","v":{"$error":"#N/A"}},{"$f":"MATCH(CD$3,Millwall!$Z99:AK99,0)","v":{"$error":"#N/A"}},{"$f":"MATCH(CE$3,Millwall!$Z99:AK99,0)","v":{"$error":"#N/A"}},null,null,null,null,null,null,null,{"$f":"Millwall!$BN77","v":"Wood"},{"$f":"Millwall!$BN77&\" (**\"","v":"Wood (**"},{"$f":"Millwall!$BN77&\"**\"","v":"Wood**"},null,{"$f":"$CM$29","v":"Wood"},{"$f":"$CN$29","v":"Wood (**"},{"$f":"$CO$29","v":"Wood**"},null,{"$f":"Millwall!$BV$30","v":2}]
[null,null,0,26,null,{"$f":"Millwall!V100","v":"1975-01-18"},null,{"$f":"Millwall!W100","v":"Notts Co"},{"$f":"Millwall!X100","v":"(H)"},{"$f":"Millwall!Y100","v":"W 3-0"},{"$f":"MATCH(K$4,Millwall!$Z100:$AK100,0)","v":8},{"$f":"MATCH(L$4,Millwall!$Z100:$AK100,0)","v":{"$error":"#N/A"}},{"$f":"MATCH(M$4,Millwall!$Z100:$AK100,0)","v":6},{"$f":"MATCH(N$4,Millwall!$Z100:$AK100,0)","v":{"$error":"#N/A"}},{"$f":"MATCH(O$4,Millwall!$Z100:$AK100,0)","v":{"$error":"#N/A"}},{"$f":"MATCH(P$4,Millwall!$Z100:$AK100,0)","v":{"$error":"#N/A"}},{"$f":"MATCH(Q$4,Millwall!$Z100:$AK100,0)","v":9},{"$f":"MATCH(R$4,Millwall!$Z100:$AK100,0)","v":{"$error":"#N/A"}},{"$f":"MATCH(S$4,Millwall!$Z100:$AK100,0)","v":{"$error":"#N/A"}},{"$f":"MATCH(T$4,Millwall!$Z100:$AK100,0)","v":{"$error":"#N/A"}},{"$f":"MATCH(U$4,Millwall!$Z100:$AK100,0)","v":4},{"$f":"MATCH(V$4,Millwall!$Z100:$AK100,0)","v":{"$error":"#N/A"}},{"$f":"MATCH(W$4,Millwall!$Z100:$AK100,0)","v":7},{"$f":"MATCH(X$4,Millwall!$Z100:$AK100,0)","v":11},{"$f":"MATCH(Y$4,Millwall!$Z100:$AK100,0)","v":12},{"$f":"MATCH(Z$4,Millwall!$Z100:$AK100,0)","v":{"$error":"#N/A"}},{"$f":"MATCH(AA$4,Millwall!$Z100:$AK100,0)","v":{"$error":"#N/A"}},{"$f":"MATCH(AB$4,Millwall!$Z100:$AK100,0)","v":1},{"$f":"MATCH(AC$4,Millwall!$Z100:$AK100,0)","v":5},{"$f":"MATCH(AD$4,Millwall!$Z100:$AK100,0)","v":3},{"$f":"MATCH(AE$4,Millwall!$Z100:$AK100,0)","v":{"$error":"#N/A"}},{"$f":"MATCH(AF$4,Millwall!$Z100:$AK100,0)","v":{"$error":"#N/A"}},{"$f":"MATCH(AG$4,Millwall!$Z100:$AK100,0)","v":2},{"$f":"MATCH(AH$3,Millwall!$Z100:$AK100,0)","v":10},{"$f":"MATCH(AI$3,Millwall!$Z100:$AK100,0)","v":{"$error":"#N/A"}},{"$f":"MATCH(AJ$3,Millwall!$Z100:$AK100,0)","v":{"$error":"#N/A"}},{"$f":"MATCH(AK$3,Millwall!$Z100:$AK100,0)","v":{"$error":"#N/A"}},{"$f":"MATCH(AL$3,Millwall!$Z100:$AK100,0)","v":{"$error":"#N/A"}},{"$f":"MATCH(AM$3,Millwall!$Z100:$AK100,0)","v":{"$error":"#N/A"}},{"$f":"MATCH(AN$3,Millwall!$Z100:$AK100,0)","v":{"$error":"#N/A"}},{"$f":"MATCH(AO$3,Millwall!$Z100:$AK100,0)","v":{"$error":"#N/A"}},{"$f":"MATCH(AP$3,Millwall!$Z100:$AK100,0)","v":{"$error":"#N/A"}},{"$f":"MATCH(AQ$3,Millwall!$Z100:$AK100,0)","v":{"$error":"#N/A"}},{"$f":"MATCH(AR$3,Millwall!$Z100:$AK100,0)","v":{"$error":"#N/A"}},null,null,null,null,null,{"$f":"MATCH(AX$3,Millwall!$Z100:AK100,0)","v":{"$error":"#N/A"}},{"$f":"MATCH(AY$3,Millwall!$Z100:AK100,0)","v":{"$error":"#N/A"}},{"$f":"MATCH(AZ$3,Millwall!$Z100:AK100,0)","v":{"$error":"#N/A"}},{"$f":"MATCH(BA$3,Millwall!$Z100:AK100,0)","v":{"$error":"#N/A"}},{"$f":"MATCH(BB$3,Millwall!$Z100:AK100,0)","v":{"$error":"#N/A"}},{"$f":"MATCH(BC$3,Millwall!$Z100:AK100,0)","v":{"$error":"#N/A"}},{"$f":"MATCH(BD$3,Millwall!$Z100:AK100,0)","v":{"$error":"#N/A"}},{"$f":"MATCH(BE$3,Millwall!$Z100:AK100,0)","v":{"$error":"#N/A"}},{"$f":"MATCH(BF$3,Millwall!$Z100:AK100,0)","v":{"$error":"#N/A"}},{"$f":"MATCH(BG$3,Millwall!$Z100:AK100,0)","v":{"$error":"#N/A"}},{"$f":"MATCH(BH$3,Millwall!$Z100:AK100,0)","v":{"$error":"#N/A"}},{"$f":"MATCH(BI$3,Millwall!$Z100:AK100,0)","v":{"$error":"#N/A"}},{"$f":"MATCH(BJ$3,Millwall!$Z100:AK100,0)","v":{"$error":"#N/A"}},{"$f":"MATCH(BK$3,Millwall!$Z100:AK100,0)","v":11},{"$f":"MATCH(BL$3,Millwall!$Z100:AK100,0)","v":12},{"$f":"MATCH(BM$3,Millwall!$Z100:AK100,0)","v":{"$error":"#N/A"}},{"$f":"MATCH(BN$3,Millwall!$Z100:AK100,0)","v":{"$error":"#N/A"}},{"$f":"MATCH(BO$3,Millwall!$Z100:AK100,0)","v":{"$error":"#N/A"}},{"$f":"MATCH(BP$3,Millwall!$Z100:AK100,0)","v":{"$error":"#N/A"}},{"$f":"MATCH(BQ$3,Millwall!$Z100:AK100,0)","v":{"$error":"#N/A"}},{"$f":"MATCH(BR$3,Millwall!$Z100:AK100,0)","v":{"$error":"#N/A"}},{"$f":"MATCH(BS$3,Millwall!$Z100:AK100,0)","v":{"$error":"#N/A"}},{"$f":"MATCH(BT$3,Millwall!$Z100:AK100,0)","v":{"$error":"#N/A"}},{"$f":"MATCH(BU$3,Millwall!$Z100:AK100,0)","v":{"$error":"#N/A"}},{"$f":"MATCH(BV$3,Millwall!$Z100:AK100,0)","v":{"$error":"#N/A"}},{"$f":"MATCH(BW$3,Millwall!$Z100:AK100,0)","v":{"$error":"#N/A"}},{"$f":"MATCH(BX$3,Millwall!$Z100:AK100,0)","v":{"$error":"#N/A"}},{"$f":"MATCH(BY$3,Millwall!$Z100:AK100,0)","v":{"$error":"#N/A"}},{"$f":"MATCH(BZ$3,Millwall!$Z100:AK100,0)","v":{"$error":"#N/A"}},{"$f":"MATCH(CA$3,Millwall!$Z100:AK100,0)","v":{"$error":"#N/A"}},{"$f":"MATCH(CB$3,Millwall!$Z100:AK100,0)","v":{"$error":"#N/A"}},{"$f":"MATCH(CC$3,Millwall!$Z100:AK100,0)","v":{"$error":"#N/A"}},{"$f":"MATCH(CD$3,Millwall!$Z100:AK100,0)","v":{"$error":"#N/A"}},{"$f":"MATCH(CE$3,Millwall!$Z100:AK100,0)","v":{"$error":"#N/A"}},null,null,null,null,null,null,null,{"$f":"Millwall!$BN78","v":0},{"$f":"Millwall!$BN78&\" (**\"","v":" (**"},{"$f":"Millwall!$BN78&\"**\"","v":"**"},null,{"$f":"$CM$30","v":0},{"$f":"$CN$30","v":" (**"},{"$f":"$CO$30","v":"**"}]
[null,null,0,27,null,{"$f":"Millwall!V101","v":"1975-01-25"},null,{"$f":"Millwall!W101","v":"Cardiff"},{"$f":"Millwall!X101","v":"(H)"},{"$f":"Millwall!Y101","v":"W 5-1"},{"$f":"MATCH(K$4,Millwall!$Z101:$AK101,0)","v":11},{"$f":"MATCH(L$4,Millwall!$Z101:$AK101,0)","v":{"$error":"#N/A"}},{"$f":"MATCH(M$4,Millwall!$Z101:$AK101,0)","v":8},{"$f":"MATCH(N$4,Millwall!$Z101:$AK101,0)","v":{"$error":"#N/A"}},{"$f":"MATCH(O$4,Millwall!$Z101:$AK101,0)","v":{"$error":"#N/A"}},{"$f":"MATCH(P$4,Millwall!$Z101:$AK101,0)","v":{"$error":"#N/A"}},{"$f":"MATCH(Q$4,Millwall!$Z101:$AK101,0)","v":9},{"$f":"MATCH(R$4,Millwall!$Z101:$AK101,0)","v":{"$error":"#N/A"}},{"$f":"MATCH(S$4,Millwall!$Z101:$AK101,0)","v":{"$error":"#N/A"}},{"$f":"MATCH(T$4,Millwall!$Z101:$AK101,0)","v":{"$error":"#N/A"}},{"$f":"MATCH(U$4,Millwall!$Z101:$AK101,0)","v":{"$error":"#N/A"}},{"$f":"MATCH(V$4,Millwall!$Z101:$AK101,0)","v":7},{"$f":"MATCH(W$4,Millwall!$Z101:$AK101,0)","v":4},{"$f":"MATCH(X$4,Millwall!$Z101:$AK101,0)","v":{"$error":"#N/A"}},{"$f":"MATCH(Y$4,Millwall!$Z101:$AK101,0)","v":{"$error":"#N/A"}},{"$f":"MATCH(Z$4,Millwall!$Z101:$AK101,0)","v":{"$error":"#N/A"}},{"$f":"MATCH(AA$4,Millwall!$Z101:$AK101,0)","v":{"$error":"#N/A"}},{"$f":"MATCH(AB$4,Millwall!$Z101:$AK101,0)","v":1},{"$f":"MATCH(AC$4,Millwall!$Z101:$AK101,0)","v":5},{"$f":"MATCH(AD$4,Millwall!$Z101:$AK101,0)","v":3},{"$f":"MATCH(AE$4,Millwall!$Z101:$AK101,0)","v":6},{"$f":"MATCH(AF$4,Millwall!$Z101:$AK101,0)","v":{"$error":"#N/A"}},{"$f":"MATCH(AG$4,Millwall!$Z101:$AK101,0)","v":2},{"$f":"MATCH(AH$3,Millwall!$Z101:$AK101,0)","v":10},{"$f":"MATCH(AI$3,Millwall!$Z101:$AK101,0)","v":{"$error":"#N/A"}},{"$f":"MATCH(AJ$3,Millwall!$Z101:$AK101,0)","v":{"$error":"#N/A"}},{"$f":"MATCH(AK$3,Millwall!$Z101:$AK101,0)","v":{"$error":"#N/A"}},{"$f":"MATCH(AL$3,Millwall!$Z101:$AK101,0)","v":{"$error":"#N/A"}},{"$f":"MATCH(AM$3,Millwall!$Z101:$AK101,0)","v":{"$error":"#N/A"}},{"$f":"MATCH(AN$3,Millwall!$Z101:$AK101,0)","v":{"$error":"#N/A"}},{"$f":"MATCH(AO$3,Millwall!$Z101:$AK101,0)","v":{"$error":"#N/A"}},{"$f":"MATCH(AP$3,Millwall!$Z101:$AK101,0)","v":{"$error":"#N/A"}},{"$f":"MATCH(AQ$3,Millwall!$Z101:$AK101,0)","v":{"$error":"#N/A"}},{"$f":"MATCH(AR$3,Millwall!$Z101:$AK101,0)","v":{"$error":"#N/A"}},null,null,null,null,null,{"$f":"MATCH(AX$3,Millwall!$Z101:AK101,0)","v":{"$error":"#N/A"}},{"$f":"MATCH(AY$3,Millwall!$Z101:AK101,0)","v":{"$error":"#N/A"}},{"$f":"MATCH(AZ$3,Millwall!$Z101:AK101,0)","v":{"$error":"#N/A"}},{"$f":"MATCH(BA$3,Millwall!$Z101:AK101,0)","v":{"$error":"#N/A"}},{"$f":"MATCH(BB$3,Millwall!$Z101:AK101,0)","v":{"$error":"#N/A"}},{"$f":"MATCH(BC$3,Millwall!$Z101:AK101,0)","v":{"$error":"#N/A"}},{"$f":"MATCH(BD$3,Millwall!$Z101:AK101,0)","v":{"$error":"#N/A"}},{"$f":"MATCH(BE$3,Millwall!$Z101:AK101,0)","v":{"$error":"#N/A"}},{"$f":"MATCH(BF$3,Millwall!$Z101:AK101,0)","v":{"$error":"#N/A"}},{"$f":"MATCH(BG$3,Millwall!$Z101:AK101,0)","v":{"$error":"#N/A"}},{"$f":"MATCH(BH$3,Millwall!$Z101:AK101,0)","v":{"$error":"#N/A"}},{"$f":"MATCH(BI$3,Millwall!$Z101:AK101,0)","v":{"$error":"#N/A"}},{"$f":"MATCH(BJ$3,Millwall!$Z101:AK101,0)","v":{"$error":"#N/A"}},{"$f":"MATCH(BK$3,Millwall!$Z101:AK101,0)","v":{"$error":"#N/A"}},{"$f":"MATCH(BL$3,Millwall!$Z101:AK101,0)","v":{"$error":"#N/A"}},{"$f":"MATCH(BM$3,Millwall!$Z101:AK101,0)","v":{"$error":"#N/A"}},{"$f":"MATCH(BN$3,Millwall!$Z101:AK101,0)","v":{"$error":"#N/A"}},{"$f":"MATCH(BO$3,Millwall!$Z101:AK101,0)","v":{"$error":"#N/A"}},{"$f":"MATCH(BP$3,Millwall!$Z101:AK101,0)","v":{"$error":"#N/A"}},{"$f":"MATCH(BQ$3,Millwall!$Z101:AK101,0)","v":{"$error":"#N/A"}},{"$f":"MATCH(BR$3,Millwall!$Z101:AK101,0)","v":{"$error":"#N/A"}},{"$f":"MATCH(BS$3,Millwall!$Z101:AK101,0)","v":{"$error":"#N/A"}},{"$f":"MATCH(BT$3,Millwall!$Z101:AK101,0)","v":{"$error":"#N/A"}},{"$f":"MATCH(BU$3,Millwall!$Z101:AK101,0)","v":{"$error":"#N/A"}},{"$f":"MATCH(BV$3,Millwall!$Z101:AK101,0)","v":{"$error":"#N/A"}},{"$f":"MATCH(BW$3,Millwall!$Z101:AK101,0)","v":{"$error":"#N/A"}},{"$f":"MATCH(BX$3,Millwall!$Z101:AK101,0)","v":{"$error":"#N/A"}},{"$f":"MATCH(BY$3,Millwall!$Z101:AK101,0)","v":{"$error":"#N/A"}},{"$f":"MATCH(BZ$3,Millwall!$Z101:AK101,0)","v":{"$error":"#N/A"}},{"$f":"MATCH(CA$3,Millwall!$Z101:AK101,0)","v":{"$error":"#N/A"}},{"$f":"MATCH(CB$3,Millwall!$Z101:AK101,0)","v":{"$error":"#N/A"}},{"$f":"MATCH(CC$3,Millwall!$Z101:AK101,0)","v":{"$error":"#N/A"}},{"$f":"MATCH(CD$3,Millwall!$Z101:AK101,0)","v":{"$error":"#N/A"}},{"$f":"MATCH(CE$3,Millwall!$Z101:AK101,0)","v":{"$error":"#N/A"}},null,null,null,null,null,null,null,{"$f":"Millwall!$BN79","v":0},{"$f":"Millwall!$BN79&\" (**\"","v":" (**"},{"$f":"Millwall!$BN79&\"**\"","v":"**"},null,{"$f":"$CM$31","v":0},{"$f":"$CN$31","v":" (**"},{"$f":"$CO$31","v":"**"}]
[null,null,0,28,null,{"$f":"Millwall!V102","v":"1975-02-01"},null,{"$f":"Millwall!W102","v":"Bolton"},{"$f":"Millwall!X102","v":"(A)"},{"$f":"Millwall!Y102","v":"L 0-2"},{"$f":"MATCH(K$4,Millwall!$Z102:$AK102,0)","v":11},{"$f":"MATCH(L$4,Millwall!$Z102:$AK102,0)","v":{"$error":"#N/A"}},{"$f":"MATCH(M$4,Millwall!$Z102:$AK102,0)","v":8},{"$f":"MATCH(N$4,Millwall!$Z102:$AK102,0)","v":{"$error":"#N/A"}},{"$f":"MATCH(O$4,Millwall!$Z102:$AK102,0)","v":{"$error":"#N/A"}},{"$f":"MATCH(P$4,Millwall!$Z102:$AK102,0)","v":{"$error":"#N/A"}},{"$f":"MATCH(Q$4,Millwall!$Z102:$AK102,0)","v":9},{"$f":"MATCH(R$4,Millwall!$Z102:$AK102,0)","v":{"$error":"#N/A"}},{"$f":"MATCH(S$4,Millwall!$Z102:$AK102,0)","v":{"$error":"#N/A"}},{"$f":"MATCH(T$4,Millwall!$Z102:$AK102,0)","v":{"$error":"#N/A"}},{"$f":"MATCH(U$4,Millwall!$Z102:$AK102,0)","v":{"$error":"#N/A"}},{"$f":"MATCH(V$4,Millwall!$Z102:$AK102,0)","v":4},{"$f":"MATCH(W$4,Millwall!$Z102:$AK102,0)","v":6},{"$f":"MATCH(X$4,Millwall!$Z102:$AK102,0)","v":{"$error":"#N/A"}},{"$f":"MATCH(Y$4,Millwall!$Z102:$AK102,0)","v":{"$error":"#N/A"}},{"$f":"MATCH(Z$4,Millwall!$Z102:$AK102,0)","v":12},{"$f":"MATCH(AA$4,Millwall!$Z102:$AK102,0)","v":{"$error":"#N/A"}},{"$f":"MATCH(AB$4,Millwall!$Z102:$AK102,0)","v":1},{"$f":"MATCH(AC$4,Millwall!$Z102:$AK102,0)","v":5},{"$f":"MATCH(AD$4,Millwall!$Z102:$AK102,0)","v":3},{"$f":"MATCH(AE$4,Millwall!$Z102:$AK102,0)","v":7},{"$f":"MATCH(AF$4,Millwall!$Z102:$AK102,0)","v":{"$error":"#N/A"}},{"$f":"MATCH(AG$4,Millwall!$Z102:$AK102,0)","v":2},{"$f":"MATCH(AH$3,Millwall!$Z102:$AK102,0)","v":10},{"$f":"MATCH(AI$3,Millwall!$Z102:$AK102,0)","v":{"$error":"#N/A"}},{"$f":"MATCH(AJ$3,Millwall!$Z102:$AK102,0)","v":{"$error":"#N/A"}},{"$f":"MATCH(AK$3,Millwall!$Z102:$AK102,0)","v":{"$error":"#N/A"}},{"$f":"MATCH(AL$3,Millwall!$Z102:$AK102,0)","v":{"$error":"#N/A"}},{"$f":"MATCH(AM$3,Millwall!$Z102:$AK102,0)","v":{"$error":"#N/A"}},{"$f":"MATCH(AN$3,Millwall!$Z102:$AK102,0)","v":{"$error":"#N/A"}},{"$f":"MATCH(AO$3,Millwall!$Z102:$AK102,0)","v":{"$error":"#N/A"}},{"$f":"MATCH(AP$3,Millwall!$Z102:$AK102,0)","v":{"$error":"#N/A"}},{"$f":"MATCH(AQ$3,Millwall!$Z102:$AK102,0)","v":{"$error":"#N/A"}},{"$f":"MATCH(AR$3,Millwall!$Z102:$AK102,0)","v":{"$error":"#N/A"}},null,null,null,null,null,{"$f":"MATCH(AX$3,Millwall!$Z102:AK102,0)","v":{"$error":"#N/A"}},{"$f":"MATCH(AY$3,Millwall!$Z102:AK102,0)","v":{"$error":"#N/A"}},{"$f":"MATCH(AZ$3,Millwall!$Z102:AK102,0)","v":{"$error":"#N/A"}},{"$f":"MATCH(BA$3,Millwall!$Z102:AK102,0)","v":{"$error":"#N/A"}},{"$f":"MATCH(BB$3,Millwall!$Z102:AK102,0)","v":{"$error":"#N/A"}},{"$f":"MATCH(BC$3,Millwall!$Z102:AK102,0)","v":{"$error":"#N/A"}},{"$f":"MATCH(BD$3,Millwall!$Z102:AK102,0)","v":9},{"$f":"MATCH(BE$3,Millwall!$Z102:AK102,0)","v":{"$error":"#N/A"}},{"$f":"MATCH(BF$3,Millwall!$Z102:AK102,0)","v":{"$error":"#N/A"}},{"$f":"MATCH(BG$3,Millwall!$Z102:AK102,0)","v":{"$error":"#N/A"}},{"$f":"MATCH(BH$3,Millwall!$Z102:AK102,0)","v":{"$error":"#N/A"}},{"$f":"MATCH(BI$3,Millwall!$Z102:AK102,0)","v":{"$error":"#N/A"}},{"$f":"MATCH(BJ$3,Millwall!$Z102:AK102,0)","v":{"$error":"#N/A"}},{"$f":"MATCH(BK$3,Millwall!$Z102:AK102,0)","v":{"$error":"#N/A"}},{"$f":"MATCH(BL$3,Millwall!$Z102:AK102,0)","v":{"$error":"#N/A"}},{"$f":"MATCH(BM$3,Millwall!$Z102:AK102,0)","v":12},{"$f":"MATCH(BN$3,Millwall!$Z102:AK102,0)","v":{"$error":"#N/A"}},{"$f":"MATCH(BO$3,Millwall!$Z102:AK102,0)","v":{"$error":"#N/A"}},{"$f":"MATCH(BP$3,Millwall!$Z102:AK102,0)","v":{"$error":"#N/A"}},{"$f":"MATCH(BQ$3,Millwall!$Z102:AK102,0)","v":{"$error":"#N/A"}},{"$f":"MATCH(BR$3,Millwall!$Z102:AK102,0)","v":{"$error":"#N/A"}},{"$f":"MATCH(BS$3,Millwall!$Z102:AK102,0)","v":{"$error":"#N/A"}},{"$f":"MATCH(BT$3,Millwall!$Z102:AK102,0)","v":{"$error":"#N/A"}},{"$f":"MATCH(BU$3,Millwall!$Z102:AK102,0)","v":{"$error":"#N/A"}},{"$f":"MATCH(BV$3,Millwall!$Z102:AK102,0)","v":{"$error":"#N/A"}},{"$f":"MATCH(BW$3,Millwall!$Z102:AK102,0)","v":{"$error":"#N/A"}},{"$f":"MATCH(BX$3,Millwall!$Z102:AK102,0)","v":{"$error":"#N/A"}},{"$f":"MATCH(BY$3,Millwall!$Z102:AK102,0)","v":{"$error":"#N/A"}},{"$f":"MATCH(BZ$3,Millwall!$Z102:AK102,0)","v":{"$error":"#N/A"}},{"$f":"MATCH(CA$3,Millwall!$Z102:AK102,0)","v":{"$error":"#N/A"}},{"$f":"MATCH(CB$3,Millwall!$Z102:AK102,0)","v":{"$error":"#N/A"}},{"$f":"MATCH(CC$3,Millwall!$Z102:AK102,0)","v":{"$error":"#N/A"}},{"$f":"MATCH(CD$3,Millwall!$Z102:AK102,0)","v":{"$error":"#N/A"}},{"$f":"MATCH(CE$3,Millwall!$Z102:AK102,0)","v":{"$error":"#N/A"}},null,null,null,null,null,null,null,{"$f":"Millwall!$BN80","v":0},{"$f":"Millwall!$BN80&\" (**\"","v":" (**"},{"$f":"Millwall!$BN80&\"**\"","v":"**"},null,{"$f":"$CM$32","v":0},{"$f":"$CN$32","v":" (**"},{"$f":"$CO$32","v":"**"}]
[null,null,0,29,null,{"$f":"Millwall!V103","v":"1975-02-08"},null,{"$f":"Millwall!W103","v":"Oldham"},{"$f":"Millwall!X103","v":"(H)"},{"$f":"Millwall!Y103","v":"D 0-0"},{"$f":"MATCH(K$4,Millwall!$Z103:$AK103,0)","v":6},{"$f":"MATCH(L$4,Millwall!$Z103:$AK103,0)","v":{"$error":"#N/A"}},{"$f":"MATCH(M$4,Millwall!$Z103:$AK103,0)","v":{"$error":"#N/A"}},{"$f":"MATCH(N$4,Millwall!$Z103:$AK103,0)","v":{"$error":"#N/A"}},{"$f":"MATCH(O$4,Millwall!$Z103:$AK103,0)","v":{"$error":"#N/A"}},{"$f":"MATCH(P$4,Millwall!$Z103:$AK103,0)","v":{"$error":"#N/A"}},{"$f":"MATCH(Q$4,Millwall!$Z103:$AK103,0)","v":9},{"$f":"MATCH(R$4,Millwall!$Z103:$AK103,0)","v":{"$error":"#N/A"}},{"$f":"MATCH(S$4,Millwall!$Z103:$AK103,0)","v":{"$error":"#N/A"}},{"$f":"MATCH(T$4,Millwall!$Z103:$AK103,0)","v":{"$error":"#N/A"}},{"$f":"MATCH(U$4,Millwall!$Z103:$AK103,0)","v":{"$error":"#N/A"}},{"$f":"MATCH(V$4,Millwall!$Z103:$AK103,0)","v":4},{"$f":"MATCH(W$4,Millwall!$Z103:$AK103,0)","v":7},{"$f":"MATCH(X$4,Millwall!$Z103:$AK103,0)","v":12},{"$f":"MATCH(Y$4,Millwall!$Z103:$AK103,0)","v":{"$error":"#N/A"}},{"$f":"MATCH(Z$4,Millwall!$Z103:$AK103,0)","v":11},{"$f":"MATCH(AA$4,Millwall!$Z103:$AK103,0)","v":{"$error":"#N/A"}},{"$f":"MATCH(AB$4,Millwall!$Z103:$AK103,0)","v":1},{"$f":"MATCH(AC$4,Millwall!$Z103:$AK103,0)","v":5},{"$f":"MATCH(AD$4,Millwall!$Z103:$AK103,0)","v":3},{"$f":"MATCH(AE$4,Millwall!$Z103:$AK103,0)","v":8},{"$f":"MATCH(AF$4,Millwall!$Z103:$AK103,0)","v":{"$error":"#N/A"}},{"$f":"MATCH(AG$4,Millwall!$Z103:$AK103,0)","v":2},{"$f":"MATCH(AH$3,Millwall!$Z103:$AK103,0)","v":10},{"$f":"MATCH(AI$3,Millwall!$Z103:$AK103,0)","v":{"$error":"#N/A"}},{"$f":"MATCH(AJ$3,Millwall!$Z103:$AK103,0)","v":{"$error":"#N/A"}},{"$f":"MATCH(AK$3,Millwall!$Z103:$AK103,0)","v":{"$error":"#N/A"}},{"$f":"MATCH(AL$3,Millwall!$Z103:$AK103,0)","v":{"$error":"#N/A"}},{"$f":"MATCH(AM$3,Millwall!$Z103:$AK103,0)","v":{"$error":"#N/A"}},{"$f":"MATCH(AN$3,Millwall!$Z103:$AK103,0)","v":{"$error":"#N/A"}},{"$f":"MATCH(AO$3,Millwall!$Z103:$AK103,0)","v":{"$error":"#N/A"}},{"$f":"MATCH(AP$3,Millwall!$Z103:$AK103,0)","v":{"$error":"#N/A"}},{"$f":"MATCH(AQ$3,Millwall!$Z103:$AK103,0)","v":{"$error":"#N/A"}},{"$f":"MATCH(AR$3,Millwall!$Z103:$AK103,0)","v":{"$error":"#N/A"}},null,null,null,null,null,{"$f":"MATCH(AX$3,Millwall!$Z103:AK103,0)","v":{"$error":"#N/A"}},{"$f":"MATCH(AY$3,Millwall!$Z103:AK103,0)","v":{"$error":"#N/A"}},{"$f":"MATCH(AZ$3,Millwall!$Z103:AK103,0)","v":{"$error":"#N/A"}},{"$f":"MATCH(BA$3,Millwall!$Z103:AK103,0)","v":{"$error":"#N/A"}},{"$f":"MATCH(BB$3,Millwall!$Z103:AK103,0)","v":{"$error":"#N/A"}},{"$f":"MATCH(BC$3,Millwall!$Z103:AK103,0)","v":{"$error":"#N/A"}},{"$f":"MATCH(BD$3,Millwall!$Z103:AK103,0)","v":9},{"$f":"MATCH(BE$3,Millwall!$Z103:AK103,0)","v":{"$error":"#N/A"}},{"$f":"MATCH(BF$3,Millwall!$Z103:AK103,0)","v":{"$error":"#N/A"}},{"$f":"MATCH(BG$3,Millwall!$Z103:AK103,0)","v":{"$error":"#N/A"}},{"$f":"MATCH(BH$3,Millwall!$Z103:AK103,0)","v":{"$error":"#N/A"}},{"$f":"MATCH(BI$3,Millwall!$Z103:AK103,0)","v":{"$error":"#N/A"}},{"$f":"MATCH(BJ$3,Millwall!$Z103:AK103,0)","v":{"$error":"#N/A"}},{"$f":"MATCH(BK$3,Millwall!$Z103:AK103,0)","v":12},{"$f":"MATCH(BL$3,Millwall!$Z103:AK103,0)","v":{"$error":"#N/A"}},{"$f":"MATCH(BM$3,Millwall!$Z103:AK103,0)","v":{"$error":"#N/A"}},{"$f":"MATCH(BN$3,Millwall!$Z103:AK103,0)","v":{"$error":"#N/A"}},{"$f":"MATCH(BO$3,Millwall!$Z103:AK103,0)","v":{"$error":"#N/A"}},{"$f":"MATCH(BP$3,Millwall!$Z103:AK103,0)","v":{"$error":"#N/A"}},{"$f":"MATCH(BQ$3,Millwall!$Z103:AK103,0)","v":{"$error":"#N/A"}},{"$f":"MATCH(BR$3,Millwall!$Z103:AK103,0)","v":{"$error":"#N/A"}},{"$f":"MATCH(BS$3,Millwall!$Z103:AK103,0)","v":{"$error":"#N/A"}},{"$f":"MATCH(BT$3,Millwall!$Z103:AK103,0)","v":{"$error":"#N/A"}},{"$f":"MATCH(BU$3,Millwall!$Z103:AK103,0)","v":{"$error":"#N/A"}},{"$f":"MATCH(BV$3,Millwall!$Z103:AK103,0)","v":{"$error":"#N/A"}},{"$f":"MATCH(BW$3,Millwall!$Z103:AK103,0)","v":{"$error":"#N/A"}},{"$f":"MATCH(BX$3,Millwall!$Z103:AK103,0)","v":{"$error":"#N/A"}},{"$f":"MATCH(BY$3,Millwall!$Z103:AK103,0)","v":{"$error":"#N/A"}},{"$f":"MATCH(BZ$3,Millwall!$Z103:AK103,0)","v":{"$error":"#N/A"}},{"$f":"MATCH(CA$3,Millwall!$Z103:AK103,0)","v":{"$error":"#N/A"}},{"$f":"MATCH(CB$3,Millwall!$Z103:AK103,0)","v":{"$error":"#N/A"}},{"$f":"MATCH(CC$3,Millwall!$Z103:AK103,0)","v":{"$error":"#N/A"}},{"$f":"MATCH(CD$3,Millwall!$Z103:AK103,0)","v":{"$error":"#N/A"}},{"$f":"MATCH(CE$3,Millwall!$Z103:AK103,0)","v":{"$error":"#N/A"}},null,null,null,null,null,null,null,{"$f":"Millwall!$BN81","v":0},{"$f":"Millwall!$BN81&\" (**\"","v":" (**"},{"$f":"Millwall!$BN81&\"**\"","v":"**"},null,{"$f":"$CM$33","v":0},{"$f":"$CN$33","v":" (**"},{"$f":"$CO$33","v":"**"}]
[null,null,0,30,null,{"$f":"Millwall!V104","v":"1975-02-14"},null,{"$f":"Millwall!W104","v":"Cardiff"},{"$f":"Millwall!X104","v":"(A)"},{"$f":"Millwall!Y104","v":"W 1-0"},{"$f":"MATCH(K$4,Millwall!$Z104:$AK104,0)","v":{"$error":"#N/A"}},{"$f":"MATCH(L$4,Millwall!$Z104:$AK104,0)","v":{"$error":"#N/A"}},{"$f":"MATCH(M$4,Millwall!$Z104:$AK104,0)","v":{"$error":"#N/A"}},{"$f":"MATCH(N$4,Millwall!$Z104:$AK104,0)","v":{"$error":"#N/A"}},{"$f":"MATCH(O$4,Millwall!$Z104:$AK104,0)","v":{"$error":"#N/A"}},{"$f":"MATCH(P$4,Millwall!$Z104:$AK104,0)","v":{"$error":"#N/A"}},{"$f":"MATCH(Q$4,Millwall!$Z104:$AK104,0)","v":12},{"$f":"MATCH(R$4,Millwall!$Z104:$AK104,0)","v":{"$error":"#N/A"}},{"$f":"MATCH(S$4,Millwall!$Z104:$AK104,0)","v":{"$error":"#N/A"}},{"$f":"MATCH(T$4,Millwall!$Z104:$AK104,0)","v":{"$error":"#N/A"}},{"$f":"MATCH(U$4,Millwall!$Z104:$AK104,0)","v":7},{"$f":"MATCH(V$4,Millwall!$Z104:$AK104,0)","v":4},{"$f":"MATCH(W$4,Millwall!$Z104:$AK104,0)","v":8},{"$f":"MATCH(X$4,Millwall!$Z104:$AK104,0)","v":11},{"$f":"MATCH(Y$4,Millwall!$Z104:$AK104,0)","v":{"$error":"#N/A"}},{"$f":"MATCH(Z$4,Millwall!$Z104:$AK104,0)","v":9},{"$f":"MATCH(AA$4,Millwall!$Z104:$AK104,0)","v":{"$error":"#N/A"}},{"$f":"MATCH(AB$4,Millwall!$Z104:$AK104,0)","v":1},{"$f":"MATCH(AC$4,Millwall!$Z104:$AK104,0)","v":5},{"$f":"MATCH(AD$4,Millwall!$Z104:$AK104,0)","v":3},{"$f":"MATCH(AE$4,Millwall!$Z104:$AK104,0)","v":6},{"$f":"MATCH(AF$4,Millwall!$Z104:$AK104,0)","v":{"$error":"#N/A"}},{"$f":"MATCH(AG$4,Millwall!$Z104:$AK104,0)","v":2},{"$f":"MATCH(AH$3,Millwall!$Z104:$AK104,0)","v":{"$error":"#N/A"}},{"$f":"MATCH(AI$3,Millwall!$Z104:$AK104,0)","v":{"$error":"#N/A"}},{"$f":"MATCH(AJ$3,Millwall!$Z104:$AK104,0)","v":{"$error":"#N/A"}},{"$f":"MATCH(AK$3,Millwall!$Z104:$AK104,0)","v":{"$error":"#N/A"}},{"$f":"MATCH(AL$3,Millwall!$Z104:$AK104,0)","v":{"$error":"#N/A"}},{"$f":"MATCH(AM$3,Millwall!$Z104:$AK104,0)","v":{"$error":"#N/A"}},{"$f":"MATCH(AN$3,Millwall!$Z104:$AK104,0)","v":{"$error":"#N/A"}},{"$f":"MATCH(AO$3,Millwall!$Z104:$AK104,0)","v":{"$error":"#N/A"}},{"$f":"MATCH(AP$3,Millwall!$Z104:$AK104,0)","v":{"$error":"#N/A"}},{"$f":"MATCH(AQ$3,Millwall!$Z104:$AK104,0)","v":{"$error":"#N/A"}},{"$f":"MATCH(AR$3,Millwall!$Z104:$AK104,0)","v":{"$error":"#N/A"}},null,null,null,null,null,{"$f":"MATCH(AX$3,Millwall!$Z104:AK104,0)","v":{"$error":"#N/A"}},{"$f":"MATCH(AY$3,Millwall!$Z104:AK104,0)","v":{"$error":"#N/A"}},{"$f":"MATCH(AZ$3,Millwall!$Z104:AK104,0)","v":{"$error":"#N/A"}},{"$f":"MATCH(BA$3,Millwall!$Z104:AK104,0)","v":{"$error":"#N/A"}},{"$f":"MATCH(BB$3,Millwall!$Z104:AK104,0)","v":{"$error":"#N/A"}},{"$f":"MATCH(BC$3,Millwall!$Z104:AK104,0)","v":{"$error":"#N/A"}},{"$f":"MATCH(BD$3,Millwall!$Z104:AK104,0)","v":12},{"$f":"MATCH(BE$3,Millwall!$Z104:AK104,0)","v":{"$error":"#N/A"}},{"$f":"MATCH(BF$3,Millwall!$Z104:AK104,0)","v":{"$error":"#N/A"}},{"$f":"MATCH(BG$3,Millwall!$Z104:AK104,0)","v":{"$error":"#N/A"}},{"$f":"MATCH(BH$3,Millwall!$Z104:AK104,0)","v":{"$error":"#N/A"}},{"$f":"MATCH(BI$3,Millwall!$Z104:AK104,0)","v":{"$error":"#N/A"}},{"$f":"MATCH(BJ$3,Millwall!$Z104:AK104,0)","v":{"$error":"#N/A"}},{"$f":"MATCH(BK$3,Millwall!$Z104:AK104,0)","v":{"$error":"#N/A"}},{"$f":"MATCH(BL$3,Millwall!$Z104:AK104,0)","v":{"$error":"#N/A"}},{"$f":"MATCH(BM$3,Millwall!$Z104:AK104,0)","v":{"$error":"#N/A"}},{"$f":"MATCH(BN$3,Millwall!$Z104:AK104,0)","v":{"$error":"#N/A"}},{"$f":"MATCH(BO$3,Millwall!$Z104:AK104,0)","v":{"$error":"#N/A"}},{"$f":"MATCH(BP$3,Millwall!$Z104:AK104,0)","v":{"$error":"#N/A"}},{"$f":"MATCH(BQ$3,Millwall!$Z104:AK104,0)","v":{"$error":"#N/A"}},{"$f":"MATCH(BR$3,Millwall!$Z104:AK104,0)","v":{"$error":"#N/A"}},{"$f":"MATCH(BS$3,Millwall!$Z104:AK104,0)","v":{"$error":"#N/A"}},{"$f":"MATCH(BT$3,Millwall!$Z104:AK104,0)","v":{"$error":"#N/A"}},{"$f":"MATCH(BU$3,Millwall!$Z104:AK104,0)","v":10},{"$f":"MATCH(BV$3,Millwall!$Z104:AK104,0)","v":{"$error":"#N/A"}},{"$f":"MATCH(BW$3,Millwall!$Z104:AK104,0)","v":{"$error":"#N/A"}},{"$f":"MATCH(BX$3,Millwall!$Z104:AK104,0)","v":{"$error":"#N/A"}},{"$f":"MATCH(BY$3,Millwall!$Z104:AK104,0)","v":{"$error":"#N/A"}},{"$f":"MATCH(BZ$3,Millwall!$Z104:AK104,0)","v":{"$error":"#N/A"}},{"$f":"MATCH(CA$3,Millwall!$Z104:AK104,0)","v":{"$error":"#N/A"}},{"$f":"MATCH(CB$3,Millwall!$Z104:AK104,0)","v":{"$error":"#N/A"}},{"$f":"MATCH(CC$3,Millwall!$Z104:AK104,0)","v":{"$error":"#N/A"}},{"$f":"MATCH(CD$3,Millwall!$Z104:AK104,0)","v":{"$error":"#N/A"}},{"$f":"MATCH(CE$3,Millwall!$Z104:AK104,0)","v":{"$error":"#N/A"}},null,null,null,null,null,null,null,{"$f":"Millwall!$BN82","v":0},{"$f":"Millwall!$BN82&\" (**\"","v":" (**"},{"$f":"Millwall!$BN82&\"**\"","v":"**"},null,{"$f":"$CM$34","v":0},{"$f":"$CN$34","v":" (**"},{"$f":"$CO$34","v":"**"}]
[null,null,0,31,null,{"$f":"Millwall!V105","v":"1975-02-22"},null,{"$f":"Millwall!W105","v":"York"},{"$f":"Millwall!X105","v":"(H)"},{"$f":"Millwall!Y105","v":"L 1-3"},{"$f":"MATCH(K$4,Millwall!$Z105:$AK105,0)","v":11},{"$f":"MATCH(L$4,Millwall!$Z105:$AK105,0)","v":{"$error":"#N/A"}},{"$f":"MATCH(M$4,Millwall!$Z105:$AK105,0)","v":8},{"$f":"MATCH(N$4,Millwall!$Z105:$AK105,0)","v":{"$error":"#N/A"}},{"$f":"MATCH(O$4,Millwall!$Z105:$AK105,0)","v":{"$error":"#N/A"}},{"$f":"MATCH(P$4,Millwall!$Z105:$AK105,0)","v":{"$error":"#N/A"}},{"$f":"MATCH(Q$4,Millwall!$Z105:$AK105,0)","v":{"$error":"#N/A"}},{"$f":"MATCH(R$4,Millwall!$Z105:$AK105,0)","v":{"$error":"#N/A"}},{"$f":"MATCH(S$4,Millwall!$Z105:$AK105,0)","v":{"$error":"#N/A"}},{"$f":"MATCH(T$4,Millwall!$Z105:$AK105,0)","v":{"$error":"#N/A"}},{"$f":"MATCH(U$4,Millwall!$Z105:$AK105,0)","v":6},{"$f":"MATCH(V$4,Millwall!$Z105:$AK105,0)","v":2},{"$f":"MATCH(W$4,Millwall!$Z105:$AK105,0)","v":4},{"$f":"MATCH(X$4,Millwall!$Z105:$AK105,0)","v":{"$error":"#N/A"}},{"$f":"MATCH(Y$4,Millwall!$Z105:$AK105,0)","v":{"$error":"#N/A"}},{"$f":"MATCH(Z$4,Millwall!$Z105:$AK105,0)","v":9},{"$f":"MATCH(AA$4,Millwall!$Z105:$AK105,0)","v":{"$error":"#N/A"}},{"$f":"MATCH(AB$4,Millwall!$Z105:$AK105,0)","v":1},{"$f":"MATCH(AC$4,Millwall!$Z105:$AK105,0)","v":5},{"$f":"MATCH(AD$4,Millwall!$Z105:$AK105,0)","v":3},{"$f":"MATCH(AE$4,Millwall!$Z105:$AK105,0)","v":7},{"$f":"MATCH(AF$4,Millwall!$Z105:$AK105,0)","v":{"$error":"#N/A"}},{"$f":"MATCH(AG$4,Millwall!$Z105:$AK105,0)","v":{"$error":"#N/A"}},{"$f":"MATCH(AH$3,Millwall!$Z105:$AK105,0)","v":10},{"$f":"MATCH(AI$3,Millwall!$Z105:$AK105,0)","v":{"$error":"#N/A"}},{"$f":"MATCH(AJ$3,Millwall!$Z105:$AK105,0)","v":{"$error":"#N/A"}},{"$f":"MATCH(AK$3,Millwall!$Z105:$AK105,0)","v":{"$error":"#N/A"}},{"$f":"MATCH(AL$3,Millwall!$Z105:$AK105,0)","v":{"$error":"#N/A"}},{"$f":"MATCH(AM$3,Millwall!$Z105:$AK105,0)","v":{"$error":"#N/A"}},{"$f":"MATCH(AN$3,Millwall!$Z105:$AK105,0)","v":{"$error":"#N/A"}},{"$f":"MATCH(AO$3,Millwall!$Z105:$AK105,0)","v":{"$error":"#N/A"}},{"$f":"MATCH(AP$3,Millwall!$Z105:$AK105,0)","v":{"$error":"#N/A"}},{"$f":"MATCH(AQ$3,Millwall!$Z105:$AK105,0)","v":{"$error":"#N/A"}},{"$f":"MATCH(AR$3,Millwall!$Z105:$AK105,0)","v":{"$error":"#N/A"}},null,null,null,null,null,{"$f":"MATCH(AX$3,Millwall!$Z105:AK105,0)","v":{"$error":"#N/A"}},{"$f":"MATCH(AY$3,Millwall!$Z105:AK105,0)","v":{"$error":"#N/A"}},{"$f":"MATCH(AZ$3,Millwall!$Z105:AK105,0)","v":{"$error":"#N/A"}},{"$f":"MATCH(BA$3,Millwall!$Z105:AK105,0)","v":{"$error":"#N/A"}},{"$f":"MATCH(BB$3,Millwall!$Z105:AK105,0)","v":{"$error":"#N/A"}},{"$f":"MATCH(BC$3,Millwall!$Z105:AK105,0)","v":{"$error":"#N/A"}},{"$f":"MATCH(BD$3,Millwall!$Z105:AK105,0)","v":{"$error":"#N/A"}},{"$f":"MATCH(BE$3,Millwall!$Z105:AK105,0)","v":{"$error":"#N/A"}},{"$f":"MATCH(BF$3,Millwall!$Z105:AK105,0)","v":{"$error":"#N/A"}},{"$f":"MATCH(BG$3,Millwall!$Z105:AK105,0)","v":{"$error":"#N/A"}},{"$f":"MATCH(BH$3,Millwall!$Z105:AK105,0)","v":{"$error":"#N/A"}},{"$f":"MATCH(BI$3,Millwall!$Z105:AK105,0)","v":{"$error":"#N/A"}},{"$f":"MATCH(BJ$3,Millwall!$Z105:AK105,0)","v":{"$error":"#N/A"}},{"$f":"MATCH(BK$3,Millwall!$Z105:AK105,0)","v":{"$error":"#N/A"}},{"$f":"MATCH(BL$3,Millwall!$Z105:AK105,0)","v":{"$error":"#N/A"}},{"$f":"MATCH(BM$3,Millwall!$Z105:AK105,0)","v":{"$error":"#N/A"}},{"$f":"MATCH(BN$3,Millwall!$Z105:AK105,0)","v":{"$error":"#N/A"}},{"$f":"MATCH(BO$3,Millwall!$Z105:AK105,0)","v":{"$error":"#N/A"}},{"$f":"MATCH(BP$3,Millwall!$Z105:AK105,0)","v":{"$error":"#N/A"}},{"$f":"MATCH(BQ$3,Millwall!$Z105:AK105,0)","v":{"$error":"#N/A"}},{"$f":"MATCH(BR$3,Millwall!$Z105:AK105,0)","v":{"$error":"#N/A"}},{"$f":"MATCH(BS$3,Millwall!$Z105:AK105,0)","v":{"$error":"#N/A"}},{"$f":"MATCH(BT$3,Millwall!$Z105:AK105,0)","v":{"$error":"#N/A"}},{"$f":"MATCH(BU$3,Millwall!$Z105:AK105,0)","v":{"$error":"#N/A"}},{"$f":"MATCH(BV$3,Millwall!$Z105:AK105,0)","v":{"$error":"#N/A"}},{"$f":"MATCH(BW$3,Millwall!$Z105:AK105,0)","v":{"$error":"#N/A"}},{"$f":"MATCH(BX$3,Millwall!$Z105:AK105,0)","v":{"$error":"#N/A"}},{"$f":"MATCH(BY$3,Millwall!$Z105:AK105,0)","v":{"$error":"#N/A"}},{"$f":"MATCH(BZ$3,Millwall!$Z105:AK105,0)","v":{"$error":"#N/A"}},{"$f":"MATCH(CA$3,Millwall!$Z105:AK105,0)","v":{"$error":"#N/A"}},{"$f":"MATCH(CB$3,Millwall!$Z105:AK105,0)","v":{"$error":"#N/A"}},{"$f":"MATCH(CC$3,Millwall!$Z105:AK105,0)","v":{"$error":"#N/A"}},{"$f":"MATCH(CD$3,Millwall!$Z105:AK105,0)","v":{"$error":"#N/A"}},{"$f":"MATCH(CE$3,Millwall!$Z105:AK105,0)","v":{"$error":"#N/A"}},null,null,null,null,null,null,null,{"$f":"Millwall!$BN83","v":0},{"$f":"Millwall!$BN83&\" (**\"","v":" (**"},{"$f":"Millwall!$BN83&\"**\"","v":"**"},null,{"$f":"$CM$35","v":0},{"$f":"$CN$35","v":" (**"},{"$f":"$CO$35","v":"**"}]
[null,null,0,32,null,{"$f":"Millwall!V106","v":"1975-03-04"},null,{"$f":"Millwall!W106","v":"Fulham"},{"$f":"Millwall!X106","v":"(A)"},{"$f":"Millwall!Y106","v":"D 0-0"},{"$f":"MATCH(K$4,Millwall!$Z106:$AK106,0)","v":12},{"$f":"MATCH(L$4,Millwall!$Z106:$AK106,0)","v":{"$error":"#N/A"}},{"$f":"MATCH(M$4,Millwall!$Z106:$AK106,0)","v":{"$error":"#N/A"}},{"$f":"MATCH(N$4,Millwall!$Z106:$AK106,0)","v":{"$error":"#N/A"}},{"$f":"MATCH(O$4,Millwall!$Z106:$AK106,0)","v":{"$error":"#N/A"}},{"$f":"MATCH(P$4,Millwall!$Z106:$AK106,0)","v":{"$error":"#N/A"}},{"$f":"MATCH(Q$4,Millwall!$Z106:$AK106,0)","v":{"$error":"#N/A"}},{"$f":"MATCH(R$4,Millwall!$Z106:$AK106,0)","v":{"$error":"#N/A"}},{"$f":"MATCH(S$4,Millwall!$Z106:$AK106,0)","v":{"$error":"#N/A"}},{"$f":"MATCH(T$4,Millwall!$Z106:$AK106,0)","v":2},{"$f":"MATCH(U$4,Millwall!$Z106:$AK106,0)","v":4},{"$f":"MATCH(V$4,Millwall!$Z106:$AK106,0)","v":{"$error":"#N/A"}},{"$f":"MATCH(W$4,Millwall!$Z106:$AK106,0)","v":7},{"$f":"MATCH(X$4,Millwall!$Z106:$AK106,0)","v":{"$error":"#N/A"}},{"$f":"MATCH(Y$4,Millwall!$Z106:$AK106,0)","v":8},{"$f":"MATCH(Z$4,Millwall!$Z106:$AK106,0)","v":9},{"$f":"MATCH(AA$4,Millwall!$Z106:$AK106,0)","v":{"$error":"#N/A"}},{"$f":"MATCH(AB$4,Millwall!$Z106:$AK106,0)","v":1},{"$f":"MATCH(AC$4,Millwall!$Z106:$AK106,0)","v":5},{"$f":"MATCH(AD$4,Millwall!$Z106:$AK106,0)","v":3},{"$f":"MATCH(AE$4,Millwall!$Z106:$AK106,0)","v":6},{"$f":"MATCH(AF$4,Millwall!$Z106:$AK106,0)","v":11},{"$f":"MATCH(AG$4,Millwall!$Z106:$AK106,0)","v":{"$error":"#N/A"}},{"$f":"MATCH(AH$3,Millwall!$Z106:$AK106,0)","v":10},{"$f":"MATCH(AI$3,Millwall!$Z106:$AK106,0)","v":{"$error":"#N/A"}},{"$f":"MATCH(AJ$3,Millwall!$Z106:$AK106,0)","v":{"$error":"#N/A"}},{"$f":"MATCH(AK$3,Millwall!$Z106:$AK106,0)","v":{"$error":"#N/A"}},{"$f":"MATCH(AL$3,Millwall!$Z106:$AK106,0)","v":{"$error":"#N/A"}},{"$f":"MATCH(AM$3,Millwall!$Z106:$AK106,0)","v":{"$error":"#N/A"}},{"$f":"MATCH(AN$3,Millwall!$Z106:$AK106,0)","v":{"$error":"#N/A"}},{"$f":"MATCH(AO$3,Millwall!$Z106:$AK106,0)","v":{"$error":"#N/A"}},{"$f":"MATCH(AP$3,Millwall!$Z106:$AK106,0)","v":{"$error":"#N/A"}},{"$f":"MATCH(AQ$3,Millwall!$Z106:$AK106,0)","v":{"$error":"#N/A"}},{"$f":"MATCH(AR$3,Millwall!$Z106:$AK106,0)","v":{"$error":"#N/A"}},null,null,null,null,null,{"$f":"MATCH(AX$3,Millwall!$Z106:AK106,0)","v":12},{"$f":"MATCH(AY$3,Millwall!$Z106:AK106,0)","v":{"$error":"#N/A"}},{"$f":"MATCH(AZ$3,Millwall!$Z106:AK106,0)","v":{"$error":"#N/A"}},{"$f":"MATCH(BA$3,Millwall!$Z106:AK106,0)","v":{"$error":"#N/A"}},{"$f":"MATCH(BB$3,Millwall!$Z106:AK106,0)","v":{"$error":"#N/A"}},{"$f":"MATCH(BC$3,Millwall!$Z106:AK106,0)","v":{"$error":"#N/A"}},{"$f":"MATCH(BD$3,Millwall!$Z106:AK106,0)","v":{"$error":"#N/A"}},{"$f":"MATCH(BE$3,Millwall!$Z106:AK106,0)","v":{"$error":"#N/A"}},{"$f":"MATCH(BF$3,Millwall!$Z106:AK106,0)","v":{"$error":"#N/A"}},{"$f":"MATCH(BG$3,Millwall!$Z106:AK106,0)","v":{"$error":"#N/A"}},{"$f":"MATCH(BH$3,Millwall!$Z106:AK106,0)","v":{"$error":"#N/A"}},{"$f":"MATCH(BI$3,Millwall!$Z106:AK106,0)","v":{"$error":"#N/A"}},{"$f":"MATCH(BJ$3,Millwall!$Z106:AK106,0)","v":{"$error":"#N/A"}},{"$f":"MATCH(BK$3,Millwall!$Z106:AK106,0)","v":{"$error":"#N/A"}},{"$f":"MATCH(BL$3,Millwall!$Z106:AK106,0)","v":{"$error":"#N/A"}},{"$f":"MATCH(BM$3,Millwall!$Z106:AK106,0)","v":{"$error":"#N/A"}},{"$f":"MATCH(BN$3,Millwall!$Z106:AK106,0)","v":{"$error":"#N/A"}},{"$f":"MATCH(BO$3,Millwall!$Z106:AK106,0)","v":{"$error":"#N/A"}},{"$f":"MATCH(BP$3,Millwall!$Z106:AK106,0)","v":{"$error":"#N/A"}},{"$f":"MATCH(BQ$3,Millwall!$Z106:AK106,0)","v":{"$error":"#N/A"}},{"$f":"MATCH(BR$3,Millwall!$Z106:AK106,0)","v":{"$error":"#N/A"}},{"$f":"MATCH(BS$3,Millwall!$Z106:AK106,0)","v":11},{"$f":"MATCH(BT$3,Millwall!$Z106:AK106,0)","v":{"$error":"#N/A"}},{"$f":"MATCH(BU$3,Millwall!$Z106:AK106,0)","v":{"$error":"#N/A"}},{"$f":"MATCH(BV$3,Millwall!$Z106:AK106,0)","v":{"$error":"#N/A"}},{"$f":"MATCH(BW$3,Millwall!$Z106:AK106,0)","v":{"$error":"#N/A"}},{"$f":"MATCH(BX$3,Millwall!$Z106:AK106,0)","v":{"$error":"#N/A"}},{"$f":"MATCH(BY$3,Millwall!$Z106:AK106,0)","v":{"$error":"#N/A"}},{"$f":"MATCH(BZ$3,Millwall!$Z106:AK106,0)","v":{"$error":"#N/A"}},{"$f":"MATCH(CA$3,Millwall!$Z106:AK106,0)","v":{"$error":"#N/A"}},{"$f":"MATCH(CB$3,Millwall!$Z106:AK106,0)","v":{"$error":"#N/A"}},{"$f":"MATCH(CC$3,Millwall!$Z106:AK106,0)","v":{"$error":"#N/A"}},{"$f":"MATCH(CD$3,Millwall!$Z106:AK106,0)","v":{"$error":"#N/A"}},{"$f":"MATCH(CE$3,Millwall!$Z106:AK106,0)","v":{"$error":"#N/A"}},null,null,null,null,null,null,null,{"$f":"Millwall!$BN84","v":0},{"$f":"Millwall!$BN84&\" (**\"","v":" (**"},{"$f":"Millwall!$BN84&\"**\"","v":"**"},null,{"$f":"$CM$36","v":0},{"$f":"$CN$36","v":" (**"},{"$f":"$CO$36","v":"**"}]
[null,null,0,33,null,{"$f":"Millwall!V107","v":"1975-03-08"},null,{"$f":"Millwall!W107","v":"Hull City"},{"$f":"Millwall!X107","v":"(H)"},{"$f":"Millwall!Y107","v":"W 2-0"},{"$f":"MATCH(K$4,Millwall!$Z107:$AK107,0)","v":{"$error":"#N/A"}},{"$f":"MATCH(L$4,Millwall!$Z107:$AK107,0)","v":{"$error":"#N/A"}},{"$f":"MATCH(M$4,Millwall!$Z107:$AK107,0)","v":{"$error":"#N/A"}},{"$f":"MATCH(N$4,Millwall!$Z107:$AK107,0)","v":{"$error":"#N/A"}},{"$f":"MATCH(O$4,Millwall!$Z107:$AK107,0)","v":{"$error":"#N/A"}},{"$f":"MATCH(P$4,Millwall!$Z107:$AK107,0)","v":{"$error":"#N/A"}},{"$f":"MATCH(Q$4,Millwall!$Z107:$AK107,0)","v":9},{"$f":"MATCH(R$4,Millwall!$Z107:$AK107,0)","v":{"$error":"#N/A"}},{"$f":"MATCH(S$4,Millwall!$Z107:$AK107,0)","v":{"$error":"#N/A"}},{"$f":"MATCH(T$4,Millwall!$Z107:$AK107,0)","v":2},{"$f":"MATCH(U$4,Millwall!$Z107:$AK107,0)","v":6},{"$f":"MATCH(V$4,Millwall!$Z107:$AK107,0)","v":{"$error":"#N/A"}},{"$f":"MATCH(W$4,Millwall!$Z107:$AK107,0)","v":4},{"$f":"MATCH(X$4,Millwall!$Z107:$AK107,0)","v":{"$error":"#N/A"}},{"$f":"MATCH(Y$4,Millwall!$Z107:$AK107,0)","v":11},{"$f":"MATCH(Z$4,Millwall!$Z107:$AK107,0)","v":{"$error":"#N/A"}},{"$f":"MATCH(AA$4,Millwall!$Z107:$AK107,0)","v":{"$error":"#N/A"}},{"$f":"MATCH(AB$4,Millwall!$Z107:$AK107,0)","v":1},{"$f":"MATCH(AC$4,Millwall!$Z107:$AK107,0)","v":5},{"$f":"MATCH(AD$4,Millwall!$Z107:$AK107,0)","v":3},{"$f":"MATCH(AE$4,Millwall!$Z107:$AK107,0)","v":7},{"$f":"MATCH(AF$4,Millwall!$Z107:$AK107,0)","v":8},{"$f":"MATCH(AG$4,Millwall!$Z107:$AK107,0)","v":{"$error":"#N/A"}},{"$f":"MATCH(AH$3,Millwall!$Z107:$AK107,0)","v":10},{"$f":"MATCH(AI$3,Millwall!$Z107:$AK107,0)","v":{"$error":"#N/A"}},{"$f":"MATCH(AJ$3,Millwall!$Z107:$AK107,0)","v":{"$error":"#N/A"}},{"$f":"MATCH(AK$3,Millwall!$Z107:$AK107,0)","v":{"$error":"#N/A"}},{"$f":"MATCH(AL$3,Millwall!$Z107:$AK107,0)","v":{"$error":"#N/A"}},{"$f":"MATCH(AM$3,Millwall!$Z107:$AK107,0)","v":{"$error":"#N/A"}},{"$f":"MATCH(AN$3,Millwall!$Z107:$AK107,0)","v":{"$error":"#N/A"}},{"$f":"MATCH(AO$3,Millwall!$Z107:$AK107,0)","v":{"$error":"#N/A"}},{"$f":"MATCH(AP$3,Millwall!$Z107:$AK107,0)","v":{"$error":"#N/A"}},{"$f":"MATCH(AQ$3,Millwall!$Z107:$AK107,0)","v":{"$error":"#N/A"}},{"$f":"MATCH(AR$3,Millwall!$Z107:$AK107,0)","v":{"$error":"#N/A"}},null,null,null,null,null,{"$f":"MATCH(AX$3,Millwall!$Z107:AK107,0)","v":{"$error":"#N/A"}},{"$f":"MATCH(AY$3,Millwall!$Z107:AK107,0)","v":{"$error":"#N/A"}},{"$f":"MATCH(AZ$3,Millwall!$Z107:AK107,0)","v":{"$error":"#N/A"}},{"$f":"MATCH(BA$3,Millwall!$Z107:AK107,0)","v":{"$error":"#N/A"}},{"$f":"MATCH(BB$3,Millwall!$Z107:AK107,0)","v":{"$error":"#N/A"}},{"$f":"MATCH(BC$3,Millwall!$Z107:AK107,0)","v":{"$error":"#N/A"}},{"$f":"MATCH(BD$3,Millwall!$Z107:AK107,0)","v":{"$error":"#N/A"}},{"$f":"MATCH(BE$3,Millwall!$Z107:AK107,0)","v":{"$error":"#N/A"}},{"$f":"MATCH(BF$3,Millwall!$Z107:AK107,0)","v":{"$error":"#N/A"}},{"$f":"MATCH(BG$3,Millwall!$Z107:AK107,0)","v":{"$error":"#N/A"}},{"$f":"MATCH(BH$3,Millwall!$Z107:AK107,0)","v":{"$error":"#N/A"}},{"$f":"MATCH(BI$3,Millwall!$Z107:AK107,0)","v":{"$error":"#N/A"}},{"$f":"MATCH(BJ$3,Millwall!$Z107:AK107,0)","v":{"$error":"#N/A"}},{"$f":"MATCH(BK$3,Millwall!$Z107:AK107,0)","v":{"$error":"#N/A"}},{"$f":"MATCH(BL$3,Millwall!$Z107:AK107,0)","v":{"$error":"#N/A"}},{"$f":"MATCH(BM$3,Millwall!$Z107:AK107,0)","v":{"$error":"#N/A"}},{"$f":"MATCH(BN$3,Millwall!$Z107:AK107,0)","v":{"$error":"#N/A"}},{"$f":"MATCH(BO$3,Millwall!$Z107:AK107,0)","v":{"$error":"#N/A"}},{"$f":"MATCH(BP$3,Millwall!$Z107:AK107,0)","v":{"$error":"#N/A"}},{"$f":"MATCH(BQ$3,Millwall!$Z107:AK107,0)","v":{"$error":"#N/A"}},{"$f":"MATCH(BR$3,Millwall!$Z107:AK107,0)","v":{"$error":"#N/A"}},{"$f":"MATCH(BS$3,Millwall!$Z107:AK107,0)","v":{"$error":"#N/A"}},{"$f":"MATCH(BT$3,Millwall!$Z107:AK107,0)","v":{"$error":"#N/A"}},{"$f":"MATCH(BU$3,Millwall!$Z107:AK107,0)","v":{"$error":"#N/A"}},{"$f":"MATCH(BV$3,Millwall!$Z107:AK107,0)","v":{"$error":"#N/A"}},{"$f":"MATCH(BW$3,Millwall!$Z107:AK107,0)","v":{"$error":"#N/A"}},{"$f":"MATCH(BX$3,Millwall!$Z107:AK107,0)","v":{"$error":"#N/A"}},{"$f":"MATCH(BY$3,Millwall!$Z107:AK107,0)","v":{"$error":"#N/A"}},{"$f":"MATCH(BZ$3,Millwall!$Z107:AK107,0)","v":{"$error":"#N/A"}},{"$f":"MATCH(CA$3,Millwall!$Z107:AK107,0)","v":{"$error":"#N/A"}},{"$f":"MATCH(CB$3,Millwall!$Z107:AK107,0)","v":{"$error":"#N/A"}},{"$f":"MATCH(CC$3,Millwall!$Z107:AK107,0)","v":{"$error":"#N/A"}},{"$f":"MATCH(CD$3,Millwall!$Z107:AK107,0)","v":{"$error":"#N/A"}},{"$f":"MATCH(CE$3,Millwall!$Z107:AK107,0)","v":{"$error":"#N/A"}},null,null,null,null,null,null,null,{"$f":"Millwall!$BN85","v":0},{"$f":"Millwall!$BN85&\" (**\"","v":" (**"},{"$f":"Millwall!$BN85&\"**\"","v":"**"},null,{"$f":"$CM$37","v":0},{"$f":"$CN$37","v":" (**"},{"$f":"$CO$37","v":"**"}]
[null,null,0,34,null,{"$f":"Millwall!V108","v":"1975-03-15"},null,{"$f":"Millwall!W108","v":"Bristol C"},{"$f":"Millwall!X108","v":"(A)"},{"$f":"Millwall!Y108","v":"L 1-2"},{"$f":"MATCH(K$4,Millwall!$Z108:$AK108,0)","v":{"$error":"#N/A"}},{"$f":"MATCH(L$4,Millwall!$Z108:$AK108,0)","v":{"$error":"#N/A"}},{"$f":"MATCH(M$4,Millwall!$Z108:$AK108,0)","v":{"$error":"#N/A"}},{"$f":"MATCH(N$4,Millwall!$Z108:$AK108,0)","v":{"$error":"#N/A"}},{"$f":"MATCH(O$4,Millwall!$Z108:$AK108,0)","v":{"$error":"#N/A"}},{"$f":"MATCH(P$4,Millwall!$Z108:$AK108,0)","v":{"$error":"#N/A"}},{"$f":"MATCH(Q$4,Millwall!$Z108:$AK108,0)","v":9},{"$f":"MATCH(R$4,Millwall!$Z108:$AK108,0)","v":{"$error":"#N/A"}},{"$f":"MATCH(S$4,Millwall!$Z108:$AK108,0)","v":{"$error":"#N/A"}},{"$f":"MATCH(T$4,Millwall!$Z108:$AK108,0)","v":2},{"$f":"MATCH(U$4,Millwall!$Z108:$AK108,0)","v":4},{"$f":"MATCH(V$4,Millwall!$Z108:$AK108,0)","v":{"$error":"#N/A"}},{"$f":"MATCH(W$4,Millwall!$Z108:$AK108,0)","v":7},{"$f":"MATCH(X$4,Millwall!$Z108:$AK108,0)","v":{"$error":"#N/A"}},{"$f":"MATCH(Y$4,Millwall!$Z108:$AK108,0)","v":8},{"$f":"MATCH(Z$4,Millwall!$Z108:$AK108,0)","v":12},{"$f":"MATCH(AA$4,Millwall!$Z108:$AK108,0)","v":{"$error":"#N/A"}},{"$f":"MATCH(AB$4,Millwall!$Z108:$AK108,0)","v":1},{"$f":"MATCH(AC$4,Millwall!$Z108:$AK108,0)","v":5},{"$f":"MATCH(AD$4,Millwall!$Z108:$AK108,0)","v":3},{"$f":"MATCH(AE$4,Millwall!$Z108:$AK108,0)","v":6},{"$f":"MATCH(AF$4,Millwall!$Z108:$AK108,0)","v":11},{"$f":"MATCH(AG$4,Millwall!$Z108:$AK108,0)","v":{"$error":"#N/A"}},{"$f":"MATCH(AH$3,Millwall!$Z108:$AK108,0)","v":10},{"$f":"MATCH(AI$3,Millwall!$Z108:$AK108,0)","v":{"$error":"#N/A"}},{"$f":"MATCH(AJ$3,Millwall!$Z108:$AK108,0)","v":{"$error":"#N/A"}},{"$f":"MATCH(AK$3,Millwall!$Z108:$AK108,0)","v":{"$error":"#N/A"}},{"$f":"MATCH(AL$3,Millwall!$Z108:$AK108,0)","v":{"$error":"#N/A"}},{"$f":"MATCH(AM$3,Millwall!$Z108:$AK108,0)","v":{"$error":"#N/A"}},{"$f":"MATCH(AN$3,Millwall!$Z108:$AK108,0)","v":{"$error":"#N/A"}},{"$f":"MATCH(AO$3,Millwall!$Z108:$AK108,0)","v":{"$error":"#N/A"}},{"$f":"MATCH(AP$3,Millwall!$Z108:$AK108,0)","v":{"$error":"#N/A"}},{"$f":"MATCH(AQ$3,Millwall!$Z108:$AK108,0)","v":{"$error":"#N/A"}},{"$f":"MATCH(AR$3,Millwall!$Z108:$AK108,0)","v":{"$error":"#N/A"}},null,null,null,null,null,{"$f":"MATCH(AX$3,Millwall!$Z108:AK108,0)","v":{"$error":"#N/A"}},{"$f":"MATCH(AY$3,Millwall!$Z108:AK108,0)","v":{"$error":"#N/A"}},{"$f":"MATCH(AZ$3,Millwall!$Z108:AK108,0)","v":{"$error":"#N/A"}},{"$f":"MATCH(BA$3,Millwall!$Z108:AK108,0)","v":{"$error":"#N/A"}},{"$f":"MATCH(BB$3,Millwall!$Z108:AK108,0)","v":{"$error":"#N/A"}},{"$f":"MATCH(BC$3,Millwall!$Z108:AK108,0)","v":{"$error":"#N/A"}},{"$f":"MATCH(BD$3,Millwall!$Z108:AK108,0)","v":{"$error":"#N/A"}},{"$f":"MATCH(BE$3,Millwall!$Z108:AK108,0)","v":{"$error":"#N/A"}},{"$f":"MATCH(BF$3,Millwall!$Z108:AK108,0)","v":{"$error":"#N/A"}},{"$f":"MATCH(BG$3,Millwall!$Z108:AK108,0)","v":{"$error":"#N/A"}},{"$f":"MATCH(BH$3,Millwall!$Z108:AK108,0)","v":{"$error":"#N/A"}},{"$f":"MATCH(BI$3,Millwall!$Z108:AK108,0)","v":{"$error":"#N/A"}},{"$f":"MATCH(BJ$3,Millwall!$Z108:AK108,0)","v":{"$error":"#N/A"}},{"$f":"MATCH(BK$3,Millwall!$Z108:AK108,0)","v":{"$error":"#N/A"}},{"$f":"MATCH(BL$3,Millwall!$Z108:AK108,0)","v":{"$error":"#N/A"}},{"$f":"MATCH(BM$3,Millwall!$Z108:AK108,0)","v":12},{"$f":"MATCH(BN$3,Millwall!$Z108:AK108,0)","v":{"$error":"#N/A"}},{"$f":"MATCH(BO$3,Millwall!$Z108:AK108,0)","v":{"$error":"#N/A"}},{"$f":"MATCH(BP$3,Millwall!$Z108:AK108,0)","v":{"$error":"#N/A"}},{"$f":"MATCH(BQ$3,Millwall!$Z108:AK108,0)","v":{"$error":"#N/A"}},{"$f":"MATCH(BR$3,Millwall!$Z108:AK108,0)","v":{"$error":"#N/A"}},{"$f":"MATCH(BS$3,Millwall!$Z108:AK108,0)","v":11},{"$f":"MATCH(BT$3,Millwall!$Z108:AK108,0)","v":{"$error":"#N/A"}},{"$f":"MATCH(BU$3,Millwall!$Z108:AK108,0)","v":{"$error":"#N/A"}},{"$f":"MATCH(BV$3,Millwall!$Z108:AK108,0)","v":{"$error":"#N/A"}},{"$f":"MATCH(BW$3,Millwall!$Z108:AK108,0)","v":{"$error":"#N/A"}},{"$f":"MATCH(BX$3,Millwall!$Z108:AK108,0)","v":{"$error":"#N/A"}},{"$f":"MATCH(BY$3,Millwall!$Z108:AK108,0)","v":{"$error":"#N/A"}},{"$f":"MATCH(BZ$3,Millwall!$Z108:AK108,0)","v":{"$error":"#N/A"}},{"$f":"MATCH(CA$3,Millwall!$Z108:AK108,0)","v":{"$error":"#N/A"}},{"$f":"MATCH(CB$3,Millwall!$Z108:AK108,0)","v":{"$error":"#N/A"}},{"$f":"MATCH(CC$3,Millwall!$Z108:AK108,0)","v":{"$error":"#N/A"}},{"$f":"MATCH(CD$3,Millwall!$Z108:AK108,0)","v":{"$error":"#N/A"}},{"$f":"MATCH(CE$3,Millwall!$Z108:AK108,0)","v":{"$error":"#N/A"}},null,null,null,null,null,null,null,{"$f":"Millwall!$BN86","v":0},{"$f":"Millwall!$BN86&\" (**\"","v":" (**"},{"$f":"Millwall!$BN86&\"**\"","v":"**"},null,{"$f":"$CM$38","v":0},{"$f":"$CN$38","v":" (**"},{"$f":"$CO$38","v":"**"}]
[null,null,0,35,null,{"$f":"Millwall!V109","v":"1975-03-22"},null,{"$f":"Millwall!W109","v":"Blackpool"},{"$f":"Millwall!X109","v":"(H)"},{"$f":"Millwall!Y109","v":"D 0-0"},{"$f":"MATCH(K$4,Millwall!$Z109:$AK109,0)","v":11},{"$f":"MATCH(L$4,Millwall!$Z109:$AK109,0)","v":{"$error":"#N/A"}},{"$f":"MATCH(M$4,Millwall!$Z109:$AK109,0)","v":{"$error":"#N/A"}},{"$f":"MATCH(N$4,Millwall!$Z109:$AK109,0)","v":{"$error":"#N/A"}},{"$f":"MATCH(O$4,Millwall!$Z109:$AK109,0)","v":{"$error":"#N/A"}},{"$f":"MATCH(P$4,Millwall!$Z109:$AK109,0)","v":6},{"$f":"MATCH(Q$4,Millwall!$Z109:$AK109,0)","v":8},{"$f":"MATCH(R$4,Millwall!$Z109:$AK109,0)","v":{"$error":"#N/A"}},{"$f":"MATCH(S$4,Millwall!$Z109:$AK109,0)","v":{"$error":"#N/A"}},{"$f":"MATCH(T$4,Millwall!$Z109:$AK109,0)","v":{"$error":"#N/A"}},{"$f":"MATCH(U$4,Millwall!$Z109:$AK109,0)","v":{"$error":"#N/A"}},{"$f":"MATCH(V$4,Millwall!$Z109:$AK109,0)","v":2},{"$f":"MATCH(W$4,Millwall!$Z109:$AK109,0)","v":4},{"$f":"MATCH(X$4,Millwall!$Z109:$AK109,0)","v":{"$error":"#N/A"}},{"$f":"MATCH(Y$4,Millwall!$Z109:$AK109,0)","v":{"$error":"#N/A"}},{"$f":"MATCH(Z$4,Millwall!$Z109:$AK109,0)","v":9},{"$f":"MATCH(AA$4,Millwall!$Z109:$AK109,0)","v":{"$error":"#N/A"}},{"$f":"MATCH(AB$4,Millwall!$Z109:$AK109,0)","v":1},{"$f":"MATCH(AC$4,Millwall!$Z109:$AK109,0)","v":5},{"$f":"MATCH(AD$4,Millwall!$Z109:$AK109,0)","v":3},{"$f":"MATCH(AE$4,Millwall!$Z109:$AK109,0)","v":7},{"$f":"MATCH(AF$4,Millwall!$Z109:$AK109,0)","v":{"$error":"#N/A"}},{"$f":"MATCH(AG$4,Millwall!$Z109:$AK109,0)","v":{"$error":"#N/A"}},{"$f":"MATCH(AH$3,Millwall!$Z109:$AK109,0)","v":10},{"$f":"MATCH(AI$3,Millwall!$Z109:$AK109,0)","v":{"$error":"#N/A"}},{"$f":"MATCH(AJ$3,Millwall!$Z109:$AK109,0)","v":{"$error":"#N/A"}},{"$f":"MATCH(AK$3,Millwall!$Z109:$AK109,0)","v":{"$error":"#N/A"}},{"$f":"MATCH(AL$3,Millwall!$Z109:$AK109,0)","v":{"$error":"#N/A"}},{"$f":"MATCH(AM$3,Millwall!$Z109:$AK109,0)","v":{"$error":"#N/A"}},{"$f":"MATCH(AN$3,Millwall!$Z109:$AK109,0)","v":{"$error":"#N/A"}},{"$f":"MATCH(AO$3,Millwall!$Z109:$AK109,0)","v":{"$error":"#N/A"}},{"$f":"MATCH(AP$3,Millwall!$Z109:$AK109,0)","v":{"$error":"#N/A"}},{"$f":"MATCH(AQ$3,Millwall!$Z109:$AK109,0)","v":{"$error":"#N/A"}},{"$f":"MATCH(AR$3,Millwall!$Z109:$AK109,0)","v":{"$error":"#N/A"}},null,null,null,null,null,{"$f":"MATCH(AX$3,Millwall!$Z109:AK109,0)","v":{"$error":"#N/A"}},{"$f":"MATCH(AY$3,Millwall!$Z109:AK109,0)","v":{"$error":"#N/A"}},{"$f":"MATCH(AZ$3,Millwall!$Z109:AK109,0)","v":{"$error":"#N/A"}},{"$f":"MATCH(BA$3,Millwall!$Z109:AK109,0)","v":{"$error":"#N/A"}},{"$f":"MATCH(BB$3,Millwall!$Z109:AK109,0)","v":{"$error":"#N/A"}},{"$f":"MATCH(BC$3,Millwall!$Z109:AK109,0)","v":{"$error":"#N/A"}},{"$f":"MATCH(BD$3,Millwall!$Z109:AK109,0)","v":{"$error":"#N/A"}},{"$f":"MATCH(BE$3,Millwall!$Z109:AK109,0)","v":{"$error":"#N/A"}},{"$f":"MATCH(BF$3,Millwall!$Z109:AK109,0)","v":{"$error":"#N/A"}},{"$f":"MATCH(BG$3,Millwall!$Z109:AK109,0)","v":{"$error":"#N/A"}},{"$f":"MATCH(BH$3,Millwall!$Z109:AK109,0)","v":{"$error":"#N/A"}},{"$f":"MATCH(BI$3,Millwall!$Z109:AK109,0)","v":{"$error":"#N/A"}},{"$f":"MATCH(BJ$3,Millwall!$Z109:AK109,0)","v":{"$error":"#N/A"}},{"$f":"MATCH(BK$3,Millwall!$Z109:AK109,0)","v":{"$error":"#N/A"}},{"$f":"MATCH(BL$3,Millwall!$Z109:AK109,0)","v":{"$error":"#N/A"}},{"$f":"MATCH(BM$3,Millwall!$Z109:AK109,0)","v":{"$error":"#N/A"}},{"$f":"MATCH(BN$3,Millwall!$Z109:AK109,0)","v":{"$error":"#N/A"}},{"$f":"MATCH(BO$3,Millwall!$Z109:AK109,0)","v":{"$error":"#N/A"}},{"$f":"MATCH(BP$3,Millwall!$Z109:AK109,0)","v":{"$error":"#N/A"}},{"$f":"MATCH(BQ$3,Millwall!$Z109:AK109,0)","v":{"$error":"#N/A"}},{"$f":"MATCH(BR$3,Millwall!$Z109:AK109,0)","v":{"$error":"#N/A"}},{"$f":"MATCH(BS$3,Millwall!$Z109:AK109,0)","v":{"$error":"#N/A"}},{"$f":"MATCH(BT$3,Millwall!$Z109:AK109,0)","v":{"$error":"#N/A"}},{"$f":"MATCH(BU$3,Millwall!$Z109:AK109,0)","v":{"$error":"#N/A"}},{"$f":"MATCH(BV$3,Millwall!$Z109:AK109,0)","v":{"$error":"#N/A"}},{"$f":"MATCH(BW$3,Millwall!$Z109:AK109,0)","v":{"$error":"#N/A"}},{"$f":"MATCH(BX$3,Millwall!$Z109:AK109,0)","v":{"$error":"#N/A"}},{"$f":"MATCH(BY$3,Millwall!$Z109:AK109,0)","v":{"$error":"#N/A"}},{"$f":"MATCH(BZ$3,Millwall!$Z109:AK109,0)","v":{"$error":"#N/A"}},{"$f":"MATCH(CA$3,Millwall!$Z109:AK109,0)","v":{"$error":"#N/A"}},{"$f":"MATCH(CB$3,Millwall!$Z109:AK109,0)","v":{"$error":"#N/A"}},{"$f":"MATCH(CC$3,Millwall!$Z109:AK109,0)","v":{"$error":"#N/A"}},{"$f":"MATCH(CD$3,Millwall!$Z109:AK109,0)","v":{"$error":"#N/A"}},{"$f":"MATCH(CE$3,Millwall!$Z109:AK109,0)","v":{"$error":"#N/A"}}]
[null,null,0,36,null,{"$f":"Millwall!V110","v":"1975-03-29"},null,{"$f":"Millwall!W110","v":"Sheff Wed"},{"$f":"Millwall!X110","v":"(A)"},{"$f":"Millwall!Y110","v":"W 1-0"},{"$f":"MATCH(K$4,Millwall!$Z110:$AK110,0)","v":{"$error":"#N/A"}},{"$f":"MATCH(L$4,Millwall!$Z110:$AK110,0)","v":{"$error":"#N/A"}},{"$f":"MATCH(M$4,Millwall!$Z110:$AK110,0)","v":{"$error":"#N/A"}},{"$f":"MATCH(N$4,Millwall!$Z110:$AK110,0)","v":{"$error":"#N/A"}},{"$f":"MATCH(O$4,Millwall!$Z110:$AK110,0)","v":{"$error":"#N/A"}},{"$f":"MATCH(P$4,Millwall!$Z110:$AK110,0)","v":4},{"$f":"MATCH(Q$4,Millwall!$Z110:$AK110,0)","v":8},{"$f":"MATCH(R$4,Millwall!$Z110:$AK110,0)","v":{"$error":"#N/A"}},{"$f":"MATCH(S$4,Millwall!$Z110:$AK110,0)","v":{"$error":"#N/A"}},{"$f":"MATCH(T$4,Millwall!$Z110:$AK110,0)","v":{"$error":"#N/A"}},{"$f":"MATCH(U$4,Millwall!$Z110:$AK110,0)","v":11},{"$f":"MATCH(V$4,Millwall!$Z110:$AK110,0)","v":2},{"$f":"MATCH(W$4,Millwall!$Z110:$AK110,0)","v":7},{"$f":"MATCH(X$4,Millwall!$Z110:$AK110,0)","v":12},{"$f":"MATCH(Y$4,Millwall!$Z110:$AK110,0)","v":{"$error":"#N/A"}},{"$f":"MATCH(Z$4,Millwall!$Z110:$AK110,0)","v":9},{"$f":"MATCH(AA$4,Millwall!$Z110:$AK110,0)","v":{"$error":"#N/A"}},{"$f":"MATCH(AB$4,Millwall!$Z110:$AK110,0)","v":1},{"$f":"MATCH(AC$4,Millwall!$Z110:$AK110,0)","v":5},{"$f":"MATCH(AD$4,Millwall!$Z110:$AK110,0)","v":3},{"$f":"MATCH(AE$4,Millwall!$Z110:$AK110,0)","v":6},{"$f":"MATCH(AF$4,Millwall!$Z110:$AK110,0)","v":{"$error":"#N/A"}},{"$f":"MATCH(AG$4,Millwall!$Z110:$AK110,0)","v":{"$error":"#N/A"}},{"$f":"MATCH(AH$3,Millwall!$Z110:$AK110,0)","v":10},{"$f":"MATCH(AI$3,Millwall!$Z110:$AK110,0)","v":{"$error":"#N/A"}},{"$f":"MATCH(AJ$3,Millwall!$Z110:$AK110,0)","v":{"$error":"#N/A"}},{"$f":"MATCH(AK$3,Millwall!$Z110:$AK110,0)","v":{"$error":"#N/A"}},{"$f":"MATCH(AL$3,Millwall!$Z110:$AK110,0)","v":{"$error":"#N/A"}},{"$f":"MATCH(AM$3,Millwall!$Z110:$AK110,0)","v":{"$error":"#N/A"}},{"$f":"MATCH(AN$3,Millwall!$Z110:$AK110,0)","v":{"$error":"#N/A"}},{"$f":"MATCH(AO$3,Millwall!$Z110:$AK110,0)","v":{"$error":"#N/A"}},{"$f":"MATCH(AP$3,Millwall!$Z110:$AK110,0)","v":{"$error":"#N/A"}},{"$f":"MATCH(AQ$3,Millwall!$Z110:$AK110,0)","v":{"$error":"#N/A"}},{"$f":"MATCH(AR$3,Millwall!$Z110:$AK110,0)","v":{"$error":"#N/A"}},null,null,null,null,null,{"$f":"MATCH(AX$3,Millwall!$Z110:AK110,0)","v":{"$error":"#N/A"}},{"$f":"MATCH(AY$3,Millwall!$Z110:AK110,0)","v":{"$error":"#N/A"}},{"$f":"MATCH(AZ$3,Millwall!$Z110:AK110,0)","v":{"$error":"#N/A"}},{"$f":"MATCH(BA$3,Millwall!$Z110:AK110,0)","v":{"$error":"#N/A"}},{"$f":"MATCH(BB$3,Millwall!$Z110:AK110,0)","v":{"$error":"#N/A"}},{"$f":"MATCH(BC$3,Millwall!$Z110:AK110,0)","v":{"$error":"#N/A"}},{"$f":"MATCH(BD$3,Millwall!$Z110:AK110,0)","v":{"$error":"#N/A"}},{"$f":"MATCH(BE$3,Millwall!$Z110:AK110,0)","v":{"$error":"#N/A"}},{"$f":"MATCH(BF$3,Millwall!$Z110:AK110,0)","v":{"$error":"#N/A"}},{"$f":"MATCH(BG$3,Millwall!$Z110:AK110,0)","v":{"$error":"#N/A"}},{"$f":"MATCH(BH$3,Millwall!$Z110:AK110,0)","v":{"$error":"#N/A"}},{"$f":"MATCH(BI$3,Millwall!$Z110:AK110,0)","v":{"$error":"#N/A"}},{"$f":"MATCH(BJ$3,Millwall!$Z110:AK110,0)","v":{"$error":"#N/A"}},{"$f":"MATCH(BK$3,Millwall!$Z110:AK110,0)","v":12},{"$f":"MATCH(BL$3,Millwall!$Z110:AK110,0)","v":{"$error":"#N/A"}},{"$f":"MATCH(BM$3,Millwall!$Z110:AK110,0)","v":{"$error":"#N/A"}},{"$f":"MATCH(BN$3,Millwall!$Z110:AK110,0)","v":{"$error":"#N/A"}},{"$f":"MATCH(BO$3,Millwall!$Z110:AK110,0)","v":{"$error":"#N/A"}},{"$f":"MATCH(BP$3,Millwall!$Z110:AK110,0)","v":{"$error":"#N/A"}},{"$f":"MATCH(BQ$3,Millwall!$Z110:AK110,0)","v":{"$error":"#N/A"}},{"$f":"MATCH(BR$3,Millwall!$Z110:AK110,0)","v":{"$error":"#N/A"}},{"$f":"MATCH(BS$3,Millwall!$Z110:AK110,0)","v":{"$error":"#N/A"}},{"$f":"MATCH(BT$3,Millwall!$Z110:AK110,0)","v":{"$error":"#N/A"}},{"$f":"MATCH(BU$3,Millwall!$Z110:AK110,0)","v":{"$error":"#N/A"}},{"$f":"MATCH(BV$3,Millwall!$Z110:AK110,0)","v":{"$error":"#N/A"}},{"$f":"MATCH(BW$3,Millwall!$Z110:AK110,0)","v":{"$error":"#N/A"}},{"$f":"MATCH(BX$3,Millwall!$Z110:AK110,0)","v":{"$error":"#N/A"}},{"$f":"MATCH(BY$3,Millwall!$Z110:AK110,0)","v":{"$error":"#N/A"}},{"$f":"MATCH(BZ$3,Millwall!$Z110:AK110,0)","v":{"$error":"#N/A"}},{"$f":"MATCH(CA$3,Millwall!$Z110:AK110,0)","v":{"$error":"#N/A"}},{"$f":"MATCH(CB$3,Millwall!$Z110:AK110,0)","v":{"$error":"#N/A"}},{"$f":"MATCH(CC$3,Millwall!$Z110:AK110,0)","v":{"$error":"#N/A"}},{"$f":"MATCH(CD$3,Millwall!$Z110:AK110,0)","v":{"$error":"#N/A"}},{"$f":"MATCH(CE$3,Millwall!$Z110:AK110,0)","v":{"$error":"#N/A"}}]
[null,null,0,37,null,{"$f":"Millwall!V111","v":"1975-03-31"},null,{"$f":"Millwall!W111","v":"Portsmouth"},{"$f":"Millwall!X111","v":"(A)"},{"$f":"Millwall!Y111","v":"L 0-1"},{"$f":"MATCH(K$4,Millwall!$Z111:$AK111,0)","v":{"$error":"#N/A"}},{"$f":"MATCH(L$4,Millwall!$Z111:$AK111,0)","v":{"$error":"#N/A"}},{"$f":"MATCH(M$4,Millwall!$Z111:$AK111,0)","v":{"$error":"#N/A"}},{"$f":"MATCH(N$4,Millwall!$Z111:$AK111,0)","v":{"$error":"#N/A"}},{"$f":"MATCH(O$4,Millwall!$Z111:$AK111,0)","v":{"$error":"#N/A"}},{"$f":"MATCH(P$4,Millwall!$Z111:$AK111,0)","v":8},{"$f":"MATCH(Q$4,Millwall!$Z111:$AK111,0)","v":{"$error":"#N/A"}},{"$f":"MATCH(R$4,Millwall!$Z111:$AK111,0)","v":{"$error":"#N/A"}},{"$f":"MATCH(S$4,Millwall!$Z111:$AK111,0)","v":{"$error":"#N/A"}},{"$f":"MATCH(T$4,Millwall!$Z111:$AK111,0)","v":{"$error":"#N/A"}},{"$f":"MATCH(U$4,Millwall!$Z111:$AK111,0)","v":4},{"$f":"MATCH(V$4,Millwall!$Z111:$AK111,0)","v":2},{"$f":"MATCH(W$4,Millwall!$Z111:$AK111,0)","v":7},{"$f":"MATCH(X$4,Millwall!$Z111:$AK111,0)","v":11},{"$f":"MATCH(Y$4,Millwall!$Z111:$AK111,0)","v":{"$error":"#N/A"}},{"$f":"MATCH(Z$4,Millwall!$Z111:$AK111,0)","v":9},{"$f":"MATCH(AA$4,Millwall!$Z111:$AK111,0)","v":{"$error":"#N/A"}},{"$f":"MATCH(AB$4,Millwall!$Z111:$AK111,0)","v":1},{"$f":"MATCH(AC$4,Millwall!$Z111:$AK111,0)","v":5},{"$f":"MATCH(AD$4,Millwall!$Z111:$AK111,0)","v":3},{"$f":"MATCH(AE$4,Millwall!$Z111:$AK111,0)","v":6},{"$f":"MATCH(AF$4,Millwall!$Z111:$AK111,0)","v":{"$error":"#N/A"}},{"$f":"MATCH(AG$4,Millwall!$Z111:$AK111,0)","v":{"$error":"#N/A"}},{"$f":"MATCH(AH$3,Millwall!$Z111:$AK111,0)","v":10},{"$f":"MATCH(AI$3,Millwall!$Z111:$AK111,0)","v":{"$error":"#N/A"}},{"$f":"MATCH(AJ$3,Millwall!$Z111:$AK111,0)","v":{"$error":"#N/A"}},{"$f":"MATCH(AK$3,Millwall!$Z111:$AK111,0)","v":{"$error":"#N/A"}},{"$f":"MATCH(AL$3,Millwall!$Z111:$AK111,0)","v":{"$error":"#N/A"}},{"$f":"MATCH(AM$3,Millwall!$Z111:$AK111,0)","v":{"$error":"#N/A"}},{"$f":"MATCH(AN$3,Millwall!$Z111:$AK111,0)","v":{"$error":"#N/A"}},{"$f":"MATCH(AO$3,Millwall!$Z111:$AK111,0)","v":{"$error":"#N/A"}},{"$f":"MATCH(AP$3,Millwall!$Z111:$AK111,0)","v":{"$error":"#N/A"}},{"$f":"MATCH(AQ$3,Millwall!$Z111:$AK111,0)","v":{"$error":"#N/A"}},{"$f":"MATCH(AR$3,Millwall!$Z111:$AK111,0)","v":{"$error":"#N/A"}},null,null,null,null,null,{"$f":"MATCH(AX$3,Millwall!$Z111:AK111,0)","v":{"$error":"#N/A"}},{"$f":"MATCH(AY$3,Millwall!$Z111:AK111,0)","v":{"$error":"#N/A"}},{"$f":"MATCH(AZ$3,Millwall!$Z111:AK111,0)","v":{"$error":"#N/A"}},{"$f":"MATCH(BA$3,Millwall!$Z111:AK111,0)","v":{"$error":"#N/A"}},{"$f":"MATCH(BB$3,Millwall!$Z111:AK111,0)","v":{"$error":"#N/A"}},{"$f":"MATCH(BC$3,Millwall!$Z111:AK111,0)","v":{"$error":"#N/A"}},{"$f":"MATCH(BD$3,Millwall!$Z111:AK111,0)","v":{"$error":"#N/A"}},{"$f":"MATCH(BE$3,Millwall!$Z111:AK111,0)","v":{"$error":"#N/A"}},{"$f":"MATCH(BF$3,Millwall!$Z111:AK111,0)","v":{"$error":"#N/A"}},{"$f":"MATCH(BG$3,Millwall!$Z111:AK111,0)","v":{"$error":"#N/A"}},{"$f":"MATCH(BH$3,Millwall!$Z111:AK111,0)","v":{"$error":"#N/A"}},{"$f":"MATCH(BI$3,Millwall!$Z111:AK111,0)","v":{"$error":"#N/A"}},{"$f":"MATCH(BJ$3,Millwall!$Z111:AK111,0)","v":{"$error":"#N/A"}},{"$f":"MATCH(BK$3,Millwall!$Z111:AK111,0)","v":{"$error":"#N/A"}},{"$f":"MATCH(BL$3,Millwall!$Z111:AK111,0)","v":{"$error":"#N/A"}},{"$f":"MATCH(BM$3,Millwall!$Z111:AK111,0)","v":{"$error":"#N/A"}},{"$f":"MATCH(BN$3,Millwall!$Z111:AK111,0)","v":{"$error":"#N/A"}},{"$f":"MATCH(BO$3,Millwall!$Z111:AK111,0)","v":{"$error":"#N/A"}},{"$f":"MATCH(BP$3,Millwall!$Z111:AK111,0)","v":{"$error":"#N/A"}},{"$f":"MATCH(BQ$3,Millwall!$Z111:AK111,0)","v":{"$error":"#N/A"}},{"$f":"MATCH(BR$3,Millwall!$Z111:AK111,0)","v":{"$error":"#N/A"}},{"$f":"MATCH(BS$3,Millwall!$Z111:AK111,0)","v":{"$error":"#N/A"}},{"$f":"MATCH(BT$3,Millwall!$Z111:AK111,0)","v":{"$error":"#N/A"}},{"$f":"MATCH(BU$3,Millwall!$Z111:AK111,0)","v":{"$error":"#N/A"}},{"$f":"MATCH(BV$3,Millwall!$Z111:AK111,0)","v":{"$error":"#N/A"}},{"$f":"MATCH(BW$3,Millwall!$Z111:AK111,0)","v":{"$error":"#N/A"}},{"$f":"MATCH(BX$3,Millwall!$Z111:AK111,0)","v":{"$error":"#N/A"}},{"$f":"MATCH(BY$3,Millwall!$Z111:AK111,0)","v":{"$error":"#N/A"}},{"$f":"MATCH(BZ$3,Millwall!$Z111:AK111,0)","v":{"$error":"#N/A"}},{"$f":"MATCH(CA$3,Millwall!$Z111:AK111,0)","v":{"$error":"#N/A"}},{"$f":"MATCH(CB$3,Millwall!$Z111:AK111,0)","v":{"$error":"#N/A"}},{"$f":"MATCH(CC$3,Millwall!$Z111:AK111,0)","v":{"$error":"#N/A"}},{"$f":"MATCH(CD$3,Millwall!$Z111:AK111,0)","v":{"$error":"#N/A"}},{"$f":"MATCH(CE$3,Millwall!$Z111:AK111,0)","v":{"$error":"#N/A"}}]
[null,null,0,38,null,{"$f":"Millwall!V112","v":"1975-04-01"},null,{"$f":"Millwall!W112","v":"Aston Villa"},{"$f":"Millwall!X112","v":"(H)"},{"$f":"Millwall!Y112","v":"L 1-3"},{"$f":"MATCH(K$4,Millwall!$Z112:$AK112,0)","v":11},{"$f":"MATCH(L$4,Millwall!$Z112:$AK112,0)","v":{"$error":"#N/A"}},{"$f":"MATCH(M$4,Millwall!$Z112:$AK112,0)","v":10},{"$f":"MATCH(N$4,Millwall!$Z112:$AK112,0)","v":{"$error":"#N/A"}},{"$f":"MATCH(O$4,Millwall!$Z112:$AK112,0)","v":{"$error":"#N/A"}},{"$f":"MATCH(P$4,Millwall!$Z112:$AK112,0)","v":4},{"$f":"MATCH(Q$4,Millwall!$Z112:$AK112,0)","v":8},{"$f":"MATCH(R$4,Millwall!$Z112:$AK112,0)","v":{"$error":"#N/A"}},{"$f":"MATCH(S$4,Millwall!$Z112:$AK112,0)","v":{"$error":"#N/A"}},{"$f":"MATCH(T$4,Millwall!$Z112:$AK112,0)","v":{"$error":"#N/A"}},{"$f":"MATCH(U$4,Millwall!$Z112:$AK112,0)","v":{"$error":"#N/A"}},{"$f":"MATCH(V$4,Millwall!$Z112:$AK112,0)","v":2},{"$f":"MATCH(W$4,Millwall!$Z112:$AK112,0)","v":7},{"$f":"MATCH(X$4,Millwall!$Z112:$AK112,0)","v":12},{"$f":"MATCH(Y$4,Millwall!$Z112:$AK112,0)","v":{"$error":"#N/A"}},{"$f":"MATCH(Z$4,Millwall!$Z112:$AK112,0)","v":9},{"$f":"MATCH(AA$4,Millwall!$Z112:$AK112,0)","v":{"$error":"#N/A"}},{"$f":"MATCH(AB$4,Millwall!$Z112:$AK112,0)","v":1},{"$f":"MATCH(AC$4,Millwall!$Z112:$AK112,0)","v":5},{"$f":"MATCH(AD$4,Millwall!$Z112:$AK112,0)","v":3},{"$f":"MATCH(AE$4,Millwall!$Z112:$AK112,0)","v":6},{"$f":"MATCH(AF$4,Millwall!$Z112:$AK112,0)","v":{"$error":"#N/A"}},{"$f":"MATCH(AG$4,Millwall!$Z112:$AK112,0)","v":{"$error":"#N/A"}},{"$f":"MATCH(AH$3,Millwall!$Z112:$AK112,0)","v":{"$error":"#N/A"}},{"$f":"MATCH(AI$3,Millwall!$Z112:$AK112,0)","v":{"$error":"#N/A"}},{"$f":"MATCH(AJ$3,Millwall!$Z112:$AK112,0)","v":{"$error":"#N/A"}},{"$f":"MATCH(AK$3,Millwall!$Z112:$AK112,0)","v":{"$error":"#N/A"}},{"$f":"MATCH(AL$3,Millwall!$Z112:$AK112,0)","v":{"$error":"#N/A"}},{"$f":"MATCH(AM$3,Millwall!$Z112:$AK112,0)","v":{"$error":"#N/A"}},{"$f":"MATCH(AN$3,Millwall!$Z112:$AK112,0)","v":{"$error":"#N/A"}},{"$f":"MATCH(AO$3,Millwall!$Z112:$AK112,0)","v":{"$error":"#N/A"}},{"$f":"MATCH(AP$3,Millwall!$Z112:$AK112,0)","v":{"$error":"#N/A"}},{"$f":"MATCH(AQ$3,Millwall!$Z112:$AK112,0)","v":{"$error":"#N/A"}},{"$f":"MATCH(AR$3,Millwall!$Z112:$AK112,0)","v":{"$error":"#N/A"}},null,null,null,null,null,{"$f":"MATCH(AX$3,Millwall!$Z112:AK112,0)","v":{"$error":"#N/A"}},{"$f":"MATCH(AY$3,Millwall!$Z112:AK112,0)","v":{"$error":"#N/A"}},{"$f":"MATCH(AZ$3,Millwall!$Z112:AK112,0)","v":{"$error":"#N/A"}},{"$f":"MATCH(BA$3,Millwall!$Z112:AK112,0)","v":{"$error":"#N/A"}},{"$f":"MATCH(BB$3,Millwall!$Z112:AK112,0)","v":{"$error":"#N/A"}},{"$f":"MATCH(BC$3,Millwall!$Z112:AK112,0)","v":{"$error":"#N/A"}},{"$f":"MATCH(BD$3,Millwall!$Z112:AK112,0)","v":{"$error":"#N/A"}},{"$f":"MATCH(BE$3,Millwall!$Z112:AK112,0)","v":{"$error":"#N/A"}},{"$f":"MATCH(BF$3,Millwall!$Z112:AK112,0)","v":{"$error":"#N/A"}},{"$f":"MATCH(BG$3,Millwall!$Z112:AK112,0)","v":{"$error":"#N/A"}},{"$f":"MATCH(BH$3,Millwall!$Z112:AK112,0)","v":{"$error":"#N/A"}},{"$f":"MATCH(BI$3,Millwall!$Z112:AK112,0)","v":{"$error":"#N/A"}},{"$f":"MATCH(BJ$3,Millwall!$Z112:AK112,0)","v":{"$error":"#N/A"}},{"$f":"MATCH(BK$3,Millwall!$Z112:AK112,0)","v":12},{"$f":"MATCH(BL$3,Millwall!$Z112:AK112,0)","v":{"$error":"#N/A"}},{"$f":"MATCH(BM$3,Millwall!$Z112:AK112,0)","v":9},{"$f":"MATCH(BN$3,Millwall!$Z112:AK112,0)","v":{"$error":"#N/A"}},{"$f":"MATCH(BO$3,Millwall!$Z112:AK112,0)","v":{"$error":"#N/A"}},{"$f":"MATCH(BP$3,Millwall!$Z112:AK112,0)","v":{"$error":"#N/A"}},{"$f":"MATCH(BQ$3,Millwall!$Z112:AK112,0)","v":{"$error":"#N/A"}},{"$f":"MATCH(BR$3,Millwall!$Z112:AK112,0)","v":{"$error":"#N/A"}},{"$f":"MATCH(BS$3,Millwall!$Z112:AK112,0)","v":{"$error":"#N/A"}},{"$f":"MATCH(BT$3,Millwall!$Z112:AK112,0)","v":{"$error":"#N/A"}},{"$f":"MATCH(BU$3,Millwall!$Z112:AK112,0)","v":{"$error":"#N/A"}},{"$f":"MATCH(BV$3,Millwall!$Z112:AK112,0)","v":{"$error":"#N/A"}},{"$f":"MATCH(BW$3,Millwall!$Z112:AK112,0)","v":{"$error":"#N/A"}},{"$f":"MATCH(BX$3,Millwall!$Z112:AK112,0)","v":{"$error":"#N/A"}},{"$f":"MATCH(BY$3,Millwall!$Z112:AK112,0)","v":{"$error":"#N/A"}},{"$f":"MATCH(BZ$3,Millwall!$Z112:AK112,0)","v":{"$error":"#N/A"}},{"$f":"MATCH(CA$3,Millwall!$Z112:AK112,0)","v":{"$error":"#N/A"}},{"$f":"MATCH(CB$3,Millwall!$Z112:AK112,0)","v":{"$error":"#N/A"}},{"$f":"MATCH(CC$3,Millwall!$Z112:AK112,0)","v":{"$error":"#N/A"}},{"$f":"MATCH(CD$3,Millwall!$Z112:AK112,0)","v":{"$error":"#N/A"}},{"$f":"MATCH(CE$3,Millwall!$Z112:AK112,0)","v":{"$error":"#N/A"}}]
[null,null,0,39,null,{"$f":"Millwall!V113","v":"1975-04-05"},null,{"$f":"Millwall!W113","v":"West Brom"},{"$f":"Millwall!X113","v":"(A)"},{"$f":"Millwall!Y113","v":"L 1-2"},{"$f":"MATCH(K$4,Millwall!$Z113:$AK113,0)","v":12},{"$f":"MATCH(L$4,Millwall!$Z113:$AK113,0)","v":{"$error":"#N/A"}},{"$f":"MATCH(M$4,Millwall!$Z113:$AK113,0)","v":11},{"$f":"MATCH(N$4,Millwall!$Z113:$AK113,0)","v":{"$error":"#N/A"}},{"$f":"MATCH(O$4,Millwall!$Z113:$AK113,0)","v":{"$error":"#N/A"}},{"$f":"MATCH(P$4,Millwall!$Z113:$AK113,0)","v":7},{"$f":"MATCH(Q$4,Millwall!$Z113:$AK113,0)","v":8},{"$f":"MATCH(R$4,Millwall!$Z113:$AK113,0)","v":{"$error":"#N/A"}},{"$f":"MATCH(S$4,Millwall!$Z113:$AK113,0)","v":{"$error":"#N/A"}},{"$f":"MATCH(T$4,Millwall!$Z113:$AK113,0)","v":{"$error":"#N/A"}},{"$f":"MATCH(U$4,Millwall!$Z113:$AK113,0)","v":{"$error":"#N/A"}},{"$f":"MATCH(V$4,Millwall!$Z113:$AK113,0)","v":2},{"$f":"MATCH(W$4,Millwall!$Z113:$AK113,0)","v":4},{"$f":"MATCH(X$4,Millwall!$Z113:$AK113,0)","v":{"$error":"#N/A"}},{"$f":"MATCH(Y$4,Millwall!$Z113:$AK113,0)","v":{"$error":"#N/A"}},{"$f":"MATCH(Z$4,Millwall!$Z113:$AK113,0)","v":9},{"$f":"MATCH(AA$4,Millwall!$Z113:$AK113,0)","v":{"$error":"#N/A"}},{"$f":"MATCH(AB$4,Millwall!$Z113:$AK113,0)","v":1},{"$f":"MATCH(AC$4,Millwall!$Z113:$AK113,0)","v":5},{"$f":"MATCH(AD$4,Millwall!$Z113:$AK113,0)","v":3},{"$f":"MATCH(AE$4,Millwall!$Z113:$AK113,0)","v":6},{"$f":"MATCH(AF$4,Millwall!$Z113:$AK113,0)","v":{"$error":"#N/A"}},{"$f":"MATCH(AG$4,Millwall!$Z113:$AK113,0)","v":{"$error":"#N/A"}},{"$f":"MATCH(AH$3,Millwall!$Z113:$AK113,0)","v":{"$error":"#N/A"}},{"$f":"MATCH(AI$3,Millwall!$Z113:$AK113,0)","v":{"$error":"#N/A"}},{"$f":"MATCH(AJ$3,Millwall!$Z113:$AK113,0)","v":{"$error":"#N/A"}},{"$f":"MATCH(AK$3,Millwall!$Z113:$AK113,0)","v":{"$error":"#N/A"}},{"$f":"MATCH(AL$3,Millwall!$Z113:$AK113,0)","v":{"$error":"#N/A"}},{"$f":"MATCH(AM$3,Millwall!$Z113:$AK113,0)","v":{"$error":"#N/A"}},{"$f":"MATCH(AN$3,Millwall!$Z113:$AK113,0)","v":{"$error":"#N/A"}},{"$f":"MATCH(AO$3,Millwall!$Z113:$AK113,0)","v":{"$error":"#N/A"}},{"$f":"MATCH(AP$3,Millwall!$Z113:$AK113,0)","v":{"$error":"#N/A"}},{"$f":"MATCH(AQ$3,Millwall!$Z113:$AK113,0)","v":{"$error":"#N/A"}},{"$f":"MATCH(AR$3,Millwall!$Z113:$AK113,0)","v":{"$error":"#N/A"}},null,null,null,null,null,{"$f":"MATCH(AX$3,Millwall!$Z113:AK113,0)","v":12},{"$f":"MATCH(AY$3,Millwall!$Z113:AK113,0)","v":{"$error":"#N/A"}},{"$f":"MATCH(AZ$3,Millwall!$Z113:AK113,0)","v":{"$error":"#N/A"}},{"$f":"MATCH(BA$3,Millwall!$Z113:AK113,0)","v":{"$error":"#N/A"}},{"$f":"MATCH(BB$3,Millwall!$Z113:AK113,0)","v":{"$error":"#N/A"}},{"$f":"MATCH(BC$3,Millwall!$Z113:AK113,0)","v":{"$error":"#N/A"}},{"$f":"MATCH(BD$3,Millwall!$Z113:AK113,0)","v":{"$error":"#N/A"}},{"$f":"MATCH(BE$3,Millwall!$Z113:AK113,0)","v":{"$error":"#N/A"}},{"$f":"MATCH(BF$3,Millwall!$Z113:AK113,0)","v":{"$error":"#N/A"}},{"$f":"MATCH(BG$3,Millwall!$Z113:AK113,0)","v":{"$error":"#N/A"}},{"$f":"MATCH(BH$3,Millwall!$Z113:AK113,0)","v":{"$error":"#N/A"}},{"$f":"MATCH(BI$3,Millwall!$Z113:AK113,0)","v":{"$error":"#N/A"}},{"$f":"MATCH(BJ$3,Millwall!$Z113:AK113,0)","v":{"$error":"#N/A"}},{"$f":"MATCH(BK$3,Millwall!$Z113:AK113,0)","v":{"$error":"#N/A"}},{"$f":"MATCH(BL$3,Millwall!$Z113:AK113,0)","v":{"$error":"#N/A"}},{"$f":"MATCH(BM$3,Millwall!$Z113:AK113,0)","v":{"$error":"#N/A"}},{"$f":"MATCH(BN$3,Millwall!$Z113:AK113,0)","v":{"$error":"#N/A"}},{"$f":"MATCH(BO$3,Millwall!$Z113:AK113,0)","v":{"$error":"#N/A"}},{"$f":"MATCH(BP$3,Millwall!$Z113:AK113,0)","v":{"$error":"#N/A"}},{"$f":"MATCH(BQ$3,Millwall!$Z113:AK113,0)","v":{"$error":"#N/A"}},{"$f":"MATCH(BR$3,Millwall!$Z113:AK113,0)","v":{"$error":"#N/A"}},{"$f":"MATCH(BS$3,Millwall!$Z113:AK113,0)","v":{"$error":"#N/A"}},{"$f":"MATCH(BT$3,Millwall!$Z113:AK113,0)","v":{"$error":"#N/A"}},{"$f":"MATCH(BU$3,Millwall!$Z113:AK113,0)","v":10},{"$f":"MATCH(BV$3,Millwall!$Z113:AK113,0)","v":{"$error":"#N/A"}},{"$f":"MATCH(BW$3,Millwall!$Z113:AK113,0)","v":{"$error":"#N/A"}},{"$f":"MATCH(BX$3,Millwall!$Z113:AK113,0)","v":{"$error":"#N/A"}},{"$f":"MATCH(BY$3,Millwall!$Z113:AK113,0)","v":{"$error":"#N/A"}},{"$f":"MATCH(BZ$3,Millwall!$Z113:AK113,0)","v":{"$error":"#N/A"}},{"$f":"MATCH(CA$3,Millwall!$Z113:AK113,0)","v":{"$error":"#N/A"}},{"$f":"MATCH(CB$3,Millwall!$Z113:AK113,0)","v":{"$error":"#N/A"}},{"$f":"MATCH(CC$3,Millwall!$Z113:AK113,0)","v":{"$error":"#N/A"}},{"$f":"MATCH(CD$3,Millwall!$Z113:AK113,0)","v":{"$error":"#N/A"}},{"$f":"MATCH(CE$3,Millwall!$Z113:AK113,0)","v":{"$error":"#N/A"}}]
[null,null,0,40,null,{"$f":"Millwall!V114","v":"1975-04-12"},null,{"$f":"Millwall!W114","v":"Norwich"},{"$f":"Millwall!X114","v":"(H)"},{"$f":"Millwall!Y114","v":"D 1-1"},{"$f":"MATCH(K$4,Millwall!$Z114:$AK114,0)","v":11},{"$f":"MATCH(L$4,Millwall!$Z114:$AK114,0)","v":{"$error":"#N/A"}},{"$f":"MATCH(M$4,Millwall!$Z114:$AK114,0)","v":10},{"$f":"MATCH(N$4,Millwall!$Z114:$AK114,0)","v":{"$error":"#N/A"}},{"$f":"MATCH(O$4,Millwall!$Z114:$AK114,0)","v":{"$error":"#N/A"}},{"$f":"MATCH(P$4,Millwall!$Z114:$AK114,0)","v":8},{"$f":"MATCH(Q$4,Millwall!$Z114:$AK114,0)","v":9},{"$f":"MATCH(R$4,Millwall!$Z114:$AK114,0)","v":{"$error":"#N/A"}},{"$f":"MATCH(S$4,Millwall!$Z114:$AK114,0)","v":{"$error":"#N/A"}},{"$f":"MATCH(T$4,Millwall!$Z114:$AK114,0)","v":{"$error":"#N/A"}},{"$f":"MATCH(U$4,Millwall!$Z114:$AK114,0)","v":4},{"$f":"MATCH(V$4,Millwall!$Z114:$AK114,0)","v":2},{"$f":"MATCH(W$4,Millwall!$Z114:$AK114,0)","v":7},{"$f":"MATCH(X$4,Millwall!$Z114:$AK114,0)","v":{"$error":"#N/A"}},{"$f":"MATCH(Y$4,Millwall!$Z114:$AK114,0)","v":{"$error":"#N/A"}},{"$f":"MATCH(Z$4,Millwall!$Z114:$AK114,0)","v":{"$error":"#N/A"}},{"$f":"MATCH(AA$4,Millwall!$Z114:$AK114,0)","v":{"$error":"#N/A"}},{"$f":"MATCH(AB$4,Millwall!$Z114:$AK114,0)","v":1},{"$f":"MATCH(AC$4,Millwall!$Z114:$AK114,0)","v":5},{"$f":"MATCH(AD$4,Millwall!$Z114:$AK114,0)","v":3},{"$f":"MATCH(AE$4,Millwall!$Z114:$AK114,0)","v":6},{"$f":"MATCH(AF$4,Millwall!$Z114:$AK114,0)","v":{"$error":"#N/A"}},{"$f":"MATCH(AG$4,Millwall!$Z114:$AK114,0)","v":{"$error":"#N/A"}},{"$f":"MATCH(AH$3,Millwall!$Z114:$AK114,0)","v":{"$error":"#N/A"}},{"$f":"MATCH(AI$3,Millwall!$Z114:$AK114,0)","v":{"$error":"#N/A"}},{"$f":"MATCH(AJ$3,Millwall!$Z114:$AK114,0)","v":{"$error":"#N/A"}},{"$f":"MATCH(AK$3,Millwall!$Z114:$AK114,0)","v":{"$error":"#N/A"}},{"$f":"MATCH(AL$3,Millwall!$Z114:$AK114,0)","v":{"$error":"#N/A"}},{"$f":"MATCH(AM$3,Millwall!$Z114:$AK114,0)","v":{"$error":"#N/A"}},{"$f":"MATCH(AN$3,Millwall!$Z114:$AK114,0)","v":{"$error":"#N/A"}},{"$f":"MATCH(AO$3,Millwall!$Z114:$AK114,0)","v":{"$error":"#N/A"}},{"$f":"MATCH(AP$3,Millwall!$Z114:$AK114,0)","v":{"$error":"#N/A"}},{"$f":"MATCH(AQ$3,Millwall!$Z114:$AK114,0)","v":{"$error":"#N/A"}},{"$f":"MATCH(AR$3,Millwall!$Z114:$AK114,0)","v":{"$error":"#N/A"}},null,null,null,null,null,{"$f":"MATCH(AX$3,Millwall!$Z114:AK114,0)","v":{"$error":"#N/A"}},{"$f":"MATCH(AY$3,Millwall!$Z114:AK114,0)","v":{"$error":"#N/A"}},{"$f":"MATCH(AZ$3,Millwall!$Z114:AK114,0)","v":{"$error":"#N/A"}},{"$f":"MATCH(BA$3,Millwall!$Z114:AK114,0)","v":{"$error":"#N/A"}},{"$f":"MATCH(BB$3,Millwall!$Z114:AK114,0)","v":{"$error":"#N/A"}},{"$f":"MATCH(BC$3,Millwall!$Z114:AK114,0)","v":{"$error":"#N/A"}},{"$f":"MATCH(BD$3,Millwall!$Z114:AK114,0)","v":{"$error":"#N/A"}},{"$f":"MATCH(BE$3,Millwall!$Z114:AK114,0)","v":{"$error":"#N/A"}},{"$f":"MATCH(BF$3,Millwall!$Z114:AK114,0)","v":{"$error":"#N/A"}},{"$f":"MATCH(BG$3,Millwall!$Z114:AK114,0)","v":{"$error":"#N/A"}},{"$f":"MATCH(BH$3,Millwall!$Z114:AK114,0)","v":{"$error":"#N/A"}},{"$f":"MATCH(BI$3,Millwall!$Z114:AK114,0)","v":{"$error":"#N/A"}},{"$f":"MATCH(BJ$3,Millwall!$Z114:AK114,0)","v":{"$error":"#N/A"}},{"$f":"MATCH(BK$3,Millwall!$Z114:AK114,0)","v":{"$error":"#N/A"}},{"$f":"MATCH(BL$3,Millwall!$Z114:AK114,0)","v":{"$error":"#N/A"}},{"$f":"MATCH(BM$3,Millwall!$Z114:AK114,0)","v":{"$error":"#N/A"}},{"$f":"MATCH(BN$3,Millwall!$Z114:AK114,0)","v":{"$error":"#N/A"}},{"$f":"MATCH(BO$3,Millwall!$Z114:AK114,0)","v":{"$error":"#N/A"}},{"$f":"MATCH(BP$3,Millwall!$Z114:AK114,0)","v":{"$error":"#N/A"}},{"$f":"MATCH(BQ$3,Millwall!$Z114:AK114,0)","v":{"$error":"#N/A"}},{"$f":"MATCH(BR$3,Millwall!$Z114:AK114,0)","v":{"$error":"#N/A"}},{"$f":"MATCH(BS$3,Millwall!$Z114:AK114,0)","v":{"$error":"#N/A"}},{"$f":"MATCH(BT$3,Millwall!$Z114:AK114,0)","v":{"$error":"#N/A"}},{"$f":"MATCH(BU$3,Millwall!$Z114:AK114,0)","v":{"$error":"#N/A"}},{"$f":"MATCH(BV$3,Millwall!$Z114:AK114,0)","v":{"$error":"#N/A"}},{"$f":"MATCH(BW$3,Millwall!$Z114:AK114,0)","v":{"$error":"#N/A"}},{"$f":"MATCH(BX$3,Millwall!$Z114:AK114,0)","v":{"$error":"#N/A"}},{"$f":"MATCH(BY$3,Millwall!$Z114:AK114,0)","v":{"$error":"#N/A"}},{"$f":"MATCH(BZ$3,Millwall!$Z114:AK114,0)","v":{"$error":"#N/A"}},{"$f":"MATCH(CA$3,Millwall!$Z114:AK114,0)","v":{"$error":"#N/A"}},{"$f":"MATCH(CB$3,Millwall!$Z114:AK114,0)","v":{"$error":"#N/A"}},{"$f":"MATCH(CC$3,Millwall!$Z114:AK114,0)","v":{"$error":"#N/A"}},{"$f":"MATCH(CD$3,Millwall!$Z114:AK114,0)","v":{"$error":"#N/A"}},{"$f":"MATCH(CE$3,Millwall!$Z114:AK114,0)","v":{"$error":"#N/A"}}]
[null,null,0,41,null,{"$f":"Millwall!V115","v":"1975-04-18"},null,{"$f":"Millwall!W115","v":"Southampton"},{"$f":"Millwall!X115","v":"(A)"},{"$f":"Millwall!Y115","v":"L 2-3"},{"$f":"MATCH(K$4,Millwall!$Z115:$AK115,0)","v":11},{"$f":"MATCH(L$4,Millwall!$Z115:$AK115,0)","v":{"$error":"#N/A"}},{"$f":"MATCH(M$4,Millwall!$Z115:$AK115,0)","v":10},{"$f":"MATCH(N$4,Millwall!$Z115:$AK115,0)","v":{"$error":"#N/A"}},{"$f":"MATCH(O$4,Millwall!$Z115:$AK115,0)","v":{"$error":"#N/A"}},{"$f":"MATCH(P$4,Millwall!$Z115:$AK115,0)","v":{"$error":"#N/A"}},{"$f":"MATCH(Q$4,Millwall!$Z115:$AK115,0)","v":9},{"$f":"MATCH(R$4,Millwall!$Z115:$AK115,0)","v":{"$error":"#N/A"}},{"$f":"MATCH(S$4,Millwall!$Z115:$AK115,0)","v":{"$error":"#N/A"}},{"$f":"MATCH(T$4,Millwall!$Z115:$AK115,0)","v":8},{"$f":"MATCH(U$4,Millwall!$Z115:$AK115,0)","v":4},{"$f":"MATCH(V$4,Millwall!$Z115:$AK115,0)","v":2},{"$f":"MATCH(W$4,Millwall!$Z115:$AK115,0)","v":7},{"$f":"MATCH(X$4,Millwall!$Z115:$AK115,0)","v":12},{"$f":"MATCH(Y$4,Millwall!$Z115:$AK115,0)","v":{"$error":"#N/A"}},{"$f":"MATCH(Z$4,Millwall!$Z115:$AK115,0)","v":{"$error":"#N/A"}},{"$f":"MATCH(AA$4,Millwall!$Z115:$AK115,0)","v":{"$error":"#N/A"}},{"$f":"MATCH(AB$4,Millwall!$Z115:$AK115,0)","v":1},{"$f":"MATCH(AC$4,Millwall!$Z115:$AK115,0)","v":5},{"$f":"MATCH(AD$4,Millwall!$Z115:$AK115,0)","v":3},{"$f":"MATCH(AE$4,Millwall!$Z115:$AK115,0)","v":6},{"$f":"MATCH(AF$4,Millwall!$Z115:$AK115,0)","v":{"$error":"#N/A"}},{"$f":"MATCH(AG$4,Millwall!$Z115:$AK115,0)","v":{"$error":"#N/A"}},{"$f":"MATCH(AH$3,Millwall!$Z115:$AK115,0)","v":{"$error":"#N/A"}},{"$f":"MATCH(AI$3,Millwall!$Z115:$AK115,0)","v":{"$error":"#N/A"}},{"$f":"MATCH(AJ$3,Millwall!$Z115:$AK115,0)","v":{"$error":"#N/A"}},{"$f":"MATCH(AK$3,Millwall!$Z115:$AK115,0)","v":{"$error":"#N/A"}},{"$f":"MATCH(AL$3,Millwall!$Z115:$AK115,0)","v":{"$error":"#N/A"}},{"$f":"MATCH(AM$3,Millwall!$Z115:$AK115,0)","v":{"$error":"#N/A"}},{"$f":"MATCH(AN$3,Millwall!$Z115:$AK115,0)","v":{"$error":"#N/A"}},{"$f":"MATCH(AO$3,Millwall!$Z115:$AK115,0)","v":{"$error":"#N/A"}},{"$f":"MATCH(AP$3,Millwall!$Z115:$AK115,0)","v":{"$error":"#N/A"}},{"$f":"MATCH(AQ$3,Millwall!$Z115:$AK115,0)","v":{"$error":"#N/A"}},{"$f":"MATCH(AR$3,Millwall!$Z115:$AK115,0)","v":{"$error":"#N/A"}},null,null,null,null,null,{"$f":"MATCH(AX$3,Millwall!$Z115:AK115,0)","v":11},{"$f":"MATCH(AY$3,Millwall!$Z115:AK115,0)","v":{"$error":"#N/A"}},{"$f":"MATCH(AZ$3,Millwall!$Z115:AK115,0)","v":{"$error":"#N/A"}},{"$f":"MATCH(BA$3,Millwall!$Z115:AK115,0)","v":{"$error":"#N/A"}},{"$f":"MATCH(BB$3,Millwall!$Z115:AK115,0)","v":{"$error":"#N/A"}},{"$f":"MATCH(BC$3,Millwall!$Z115:AK115,0)","v":{"$error":"#N/A"}},{"$f":"MATCH(BD$3,Millwall!$Z115:AK115,0)","v":{"$error":"#N/A"}},{"$f":"MATCH(BE$3,Millwall!$Z115:AK115,0)","v":{"$error":"#N/A"}},{"$f":"MATCH(BF$3,Millwall!$Z115:AK115,0)","v":{"$error":"#N/A"}},{"$f":"MATCH(BG$3,Millwall!$Z115:AK115,0)","v":{"$error":"#N/A"}},{"$f":"MATCH(BH$3,Millwall!$Z115:AK115,0)","v":{"$error":"#N/A"}},{"$f":"MATCH(BI$3,Millwall!$Z115:AK115,0)","v":{"$error":"#N/A"}},{"$f":"MATCH(BJ$3,Millwall!$Z115:AK115,0)","v":{"$error":"#N/A"}},{"$f":"MATCH(BK$3,Millwall!$Z115:AK115,0)","v":12},{"$f":"MATCH(BL$3,Millwall!$Z115:AK115,0)","v":{"$error":"#N/A"}},{"$f":"MATCH(BM$3,Millwall!$Z115:AK115,0)","v":{"$error":"#N/A"}},{"$f":"MATCH(BN$3,Millwall!$Z115:AK115,0)","v":{"$error":"#N/A"}},{"$f":"MATCH(BO$3,Millwall!$Z115:AK115,0)","v":{"$error":"#N/A"}},{"$f":"MATCH(BP$3,Millwall!$Z115:AK115,0)","v":{"$error":"#N/A"}},{"$f":"MATCH(BQ$3,Millwall!$Z115:AK115,0)","v":{"$error":"#N/A"}},{"$f":"MATCH(BR$3,Millwall!$Z115:AK115,0)","v":{"$error":"#N/A"}},{"$f":"MATCH(BS$3,Millwall!$Z115:AK115,0)","v":{"$error":"#N/A"}},{"$f":"MATCH(BT$3,Millwall!$Z115:AK115,0)","v":{"$error":"#N/A"}},{"$f":"MATCH(BU$3,Millwall!$Z115:AK115,0)","v":{"$error":"#N/A"}},{"$f":"MATCH(BV$3,Millwall!$Z115:AK115,0)","v":{"$error":"#N/A"}},{"$f":"MATCH(BW$3,Millwall!$Z115:AK115,0)","v":{"$error":"#N/A"}},{"$f":"MATCH(BX$3,Millwall!$Z115:AK115,0)","v":{"$error":"#N/A"}},{"$f":"MATCH(BY$3,Millwall!$Z115:AK115,0)","v":{"$error":"#N/A"}},{"$f":"MATCH(BZ$3,Millwall!$Z115:AK115,0)","v":{"$error":"#N/A"}},{"$f":"MATCH(CA$3,Millwall!$Z115:AK115,0)","v":{"$error":"#N/A"}},{"$f":"MATCH(CB$3,Millwall!$Z115:AK115,0)","v":{"$error":"#N/A"}},{"$f":"MATCH(CC$3,Millwall!$Z115:AK115,0)","v":{"$error":"#N/A"}},{"$f":"MATCH(CD$3,Millwall!$Z115:AK115,0)","v":{"$error":"#N/A"}},{"$f":"MATCH(CE$3,Millwall!$Z115:AK115,0)","v":{"$error":"#N/A"}}]
[null,null,0,42,null,{"$f":"Millwall!V116","v":"1975-04-26"},null,{"$f":"Millwall!W116","v":"Bristol R"},{"$f":"Millwall!X116","v":"(H)"},{"$f":"Millwall!Y116","v":"D 1-1"},{"$f":"MATCH(K$4,Millwall!$Z116:$AK116,0)","v":10},{"$f":"MATCH(L$4,Millwall!$Z116:$AK116,0)","v":{"$error":"#N/A"}},{"$f":"MATCH(M$4,Millwall!$Z116:$AK116,0)","v":{"$error":"#N/A"}},{"$f":"MATCH(N$4,Millwall!$Z116:$AK116,0)","v":{"$error":"#N/A"}},{"$f":"MATCH(O$4,Millwall!$Z116:$AK116,0)","v":{"$error":"#N/A"}},{"$f":"MATCH(P$4,Millwall!$Z116:$AK116,0)","v":{"$error":"#N/A"}},{"$f":"MATCH(Q$4,Millwall!$Z116:$AK116,0)","v":9},{"$f":"MATCH(R$4,Millwall!$Z116:$AK116,0)","v":{"$error":"#N/A"}},{"$f":"MATCH(S$4,Millwall!$Z116:$AK116,0)","v":{"$error":"#N/A"}},{"$f":"MATCH(T$4,Millwall!$Z116:$AK116,0)","v":8},{"$f":"MATCH(U$4,Millwall!$Z116:$AK116,0)","v":4},{"$f":"MATCH(V$4,Millwall!$Z116:$AK116,0)","v":2},{"$f":"MATCH(W$4,Millwall!$Z116:$AK116,0)","v":7},{"$f":"MATCH(X$4,Millwall!$Z116:$AK116,0)","v":11},{"$f":"MATCH(Y$4,Millwall!$Z116:$AK116,0)","v":{"$error":"#N/A"}},{"$f":"MATCH(Z$4,Millwall!$Z116:$AK116,0)","v":{"$error":"#N/A"}},{"$f":"MATCH(AA$4,Millwall!$Z116:$AK116,0)","v":{"$error":"#N/A"}},{"$f":"MATCH(AB$4,Millwall!$Z116:$AK116,0)","v":1},{"$f":"MATCH(AC$4,Millwall!$Z116:$AK116,0)","v":5},{"$f":"MATCH(AD$4,Millwall!$Z116:$AK116,0)","v":3},{"$f":"MATCH(AE$4,Millwall!$Z116:$AK116,0)","v":6},{"$f":"MATCH(AF$4,Millwall!$Z116:$AK116,0)","v":{"$error":"#N/A"}},{"$f":"MATCH(AG$4,Millwall!$Z116:$AK116,0)","v":{"$error":"#N/A"}},{"$f":"MATCH(AH$3,Millwall!$Z116:$AK116,0)","v":{"$error":"#N/A"}},{"$f":"MATCH(AI$3,Millwall!$Z116:$AK116,0)","v":{"$error":"#N/A"}},{"$f":"MATCH(AJ$3,Millwall!$Z116:$AK116,0)","v":{"$error":"#N/A"}},{"$f":"MATCH(AK$3,Millwall!$Z116:$AK116,0)","v":{"$error":"#N/A"}},{"$f":"MATCH(AL$3,Millwall!$Z116:$AK116,0)","v":{"$error":"#N/A"}},{"$f":"MATCH(AM$3,Millwall!$Z116:$AK116,0)","v":{"$error":"#N/A"}},{"$f":"MATCH(AN$3,Millwall!$Z116:$AK116,0)","v":{"$error":"#N/A"}},{"$f":"MATCH(AO$3,Millwall!$Z116:$AK116,0)","v":{"$error":"#N/A"}},{"$f":"MATCH(AP$3,Millwall!$Z116:$AK116,0)","v":{"$error":"#N/A"}},{"$f":"MATCH(AQ$3,Millwall!$Z116:$AK116,0)","v":{"$error":"#N/A"}},{"$f":"MATCH(AR$3,Millwall!$Z116:$AK116,0)","v":{"$error":"#N/A"}},null,null,null,null,null,{"$f":"MATCH(AX$3,Millwall!$Z116:AK116,0)","v":{"$error":"#N/A"}},{"$f":"MATCH(AY$3,Millwall!$Z116:AK116,0)","v":{"$error":"#N/A"}},{"$f":"MATCH(AZ$3,Millwall!$Z116:AK116,0)","v":{"$error":"#N/A"}},{"$f":"MATCH(BA$3,Millwall!$Z116:AK116,0)","v":{"$error":"#N/A"}},{"$f":"MATCH(BB$3,Millwall!$Z116:AK116,0)","v":{"$error":"#N/A"}},{"$f":"MATCH(BC$3,Millwall!$Z116:AK116,0)","v":{"$error":"#N/A"}},{"$f":"MATCH(BD$3,Millwall!$Z116:AK116,0)","v":{"$error":"#N/A"}},{"$f":"MATCH(BE$3,Millwall!$Z116:AK116,0)","v":{"$error":"#N/A"}},{"$f":"MATCH(BF$3,Millwall!$Z116:AK116,0)","v":{"$error":"#N/A"}},{"$f":"MATCH(BG$3,Millwall!$Z116:AK116,0)","v":{"$error":"#N/A"}},{"$f":"MATCH(BH$3,Millwall!$Z116:AK116,0)","v":{"$error":"#N/A"}},{"$f":"MATCH(BI$3,Millwall!$Z116:AK116,0)","v":{"$error":"#N/A"}},{"$f":"MATCH(BJ$3,Millwall!$Z116:AK116,0)","v":{"$error":"#N/A"}},{"$f":"MATCH(BK$3,Millwall!$Z116:AK116,0)","v":{"$error":"#N/A"}},{"$f":"MATCH(BL$3,Millwall!$Z116:AK116,0)","v":{"$error":"#N/A"}},{"$f":"MATCH(BM$3,Millwall!$Z116:AK116,0)","v":{"$error":"#N/A"}},{"$f":"MATCH(BN$3,Millwall!$Z116:AK116,0)","v":{"$error":"#N/A"}},{"$f":"MATCH(BO$3,Millwall!$Z116:AK116,0)","v":{"$error":"#N/A"}},{"$f":"MATCH(BP$3,Millwall!$Z116:AK116,0)","v":{"$error":"#N/A"}},{"$f":"MATCH(BQ$3,Millwall!$Z116:AK116,0)","v":{"$error":"#N/A"}},{"$f":"MATCH(BR$3,Millwall!$Z116:AK116,0)","v":{"$error":"#N/A"}},{"$f":"MATCH(BS$3,Millwall!$Z116:AK116,0)","v":{"$error":"#N/A"}},{"$f":"MATCH(BT$3,Millwall!$Z116:AK116,0)","v":{"$error":"#N/A"}},{"$f":"MATCH(BU$3,Millwall!$Z116:AK116,0)","v":{"$error":"#N/A"}},{"$f":"MATCH(BV$3,Millwall!$Z116:AK116,0)","v":{"$error":"#N/A"}},{"$f":"MATCH(BW$3,Millwall!$Z116:AK116,0)","v":{"$error":"#N/A"}},{"$f":"MATCH(BX$3,Millwall!$Z116:AK116,0)","v":{"$error":"#N/A"}},{"$f":"MATCH(BY$3,Millwall!$Z116:AK116,0)","v":{"$error":"#N/A"}},{"$f":"MATCH(BZ$3,Millwall!$Z116:AK116,0)","v":{"$error":"#N/A"}},{"$f":"MATCH(CA$3,Millwall!$Z116:AK116,0)","v":{"$error":"#N/A"}},{"$f":"MATCH(CB$3,Millwall!$Z116:AK116,0)","v":{"$error":"#N/A"}},{"$f":"MATCH(CC$3,Millwall!$Z116:AK116,0)","v":{"$error":"#N/A"}},{"$f":"MATCH(CD$3,Millwall!$Z116:AK116,0)","v":{"$error":"#N/A"}},{"$f":"MATCH(CE$3,Millwall!$Z116:AK116,0)","v":{"$error":"#N/A"}}]
[null,null,1,43,null,{"$f":"Millwall!V120","v":"00:00:00"},null,{"$f":"Millwall!W120","v":"00:00:00"},{"$f":"Millwall!X120","v":"00:00:00"},{"$f":"Millwall!Y120","v":0},{"$f":"MATCH(K$4,Millwall!$Z117:$AK117,0)","v":{"$error":"#N/A"}},{"$f":"MATCH(L$4,Millwall!$Z117:$AK117,0)","v":{"$error":"#N/A"}},{"$f":"MATCH(M$4,Millwall!$Z117:$AK117,0)","v":{"$error":"#N/A"}},{"$f":"MATCH(N$4,Millwall!$Z117:$AK117,0)","v":{"$error":"#N/A"}},{"$f":"MATCH(O$4,Millwall!$Z117:$AK117,0)","v":{"$error":"#N/A"}},{"$f":"MATCH(P$4,Millwall!$Z117:$AK117,0)","v":{"$error":"#N/A"}},{"$f":"MATCH(Q$4,Millwall!$Z117:$AK117,0)","v":{"$error":"#N/A"}},{"$f":"MATCH(R$4,Millwall!$Z117:$AK117,0)","v":{"$error":"#N/A"}},{"$f":"MATCH(S$4,Millwall!$Z117:$AK117,0)","v":{"$error":"#N/A"}},{"$f":"MATCH(T$4,Millwall!$Z117:$AK117,0)","v":{"$error":"#N/A"}},{"$f":"MATCH(U$4,Millwall!$Z117:$AK117,0)","v":{"$error":"#N/A"}},{"$f":"MATCH(V$4,Millwall!$Z117:$AK117,0)","v":{"$error":"#N/A"}},{"$f":"MATCH(W$4,Millwall!$Z117:$AK117,0)","v":{"$error":"#N/A"}},{"$f":"MATCH(X$4,Millwall!$Z117:$AK117,0)","v":{"$error":"#N/A"}},{"$f":"MATCH(Y$4,Millwall!$Z117:$AK117,0)","v":{"$error":"#N/A"}},{"$f":"MATCH(Z$4,Millwall!$Z117:$AK117,0)","v":{"$error":"#N/A"}},{"$f":"MATCH(AA$4,Millwall!$Z117:$AK117,0)","v":{"$error":"#N/A"}},{"$f":"MATCH(AB$4,Millwall!$Z117:$AK117,0)","v":{"$error":"#N/A"}},{"$f":"MATCH(AC$4,Millwall!$Z117:$AK117,0)","v":{"$error":"#N/A"}},{"$f":"MATCH(AD$4,Millwall!$Z117:$AK117,0)","v":{"$error":"#N/A"}},{"$f":"MATCH(AE$4,Millwall!$Z117:$AK117,0)","v":{"$error":"#N/A"}},{"$f":"MATCH(AF$4,Millwall!$Z117:$AK117,0)","v":{"$error":"#N/A"}},{"$f":"MATCH(AG$4,Millwall!$Z117:$AK117,0)","v":{"$error":"#N/A"}},{"$f":"MATCH(AH$3,Millwall!$Z117:$AK117,0)","v":{"$error":"#N/A"}},{"$f":"MATCH(AI$3,Millwall!$Z117:$AK117,0)","v":{"$error":"#N/A"}},{"$f":"MATCH(AJ$3,Millwall!$Z117:$AK117,0)","v":{"$error":"#N/A"}},{"$f":"MATCH(AK$3,Millwall!$Z117:$AK117,0)","v":{"$error":"#N/A"}},{"$f":"MATCH(AL$3,Millwall!$Z117:$AK117,0)","v":{"$error":"#N/A"}},{"$f":"MATCH(AM$3,Millwall!$Z117:$AK117,0)","v":{"$error":"#N/A"}},{"$f":"MATCH(AN$3,Millwall!$Z117:$AK117,0)","v":{"$error":"#N/A"}},{"$f":"MATCH(AO$3,Millwall!$Z117:$AK117,0)","v":{"$error":"#N/A"}},{"$f":"MATCH(AP$3,Millwall!$Z117:$AK117,0)","v":{"$error":"#N/A"}},{"$f":"MATCH(AQ$3,Millwall!$Z117:$AK117,0)","v":{"$error":"#N/A"}},{"$f":"MATCH(AR$3,Millwall!$Z117:$AK117,0)","v":{"$error":"#N/A"}},null,null,null,null,null,{"$f":"MATCH(AX$3,Millwall!$Z117:AK117,0)","v":{"$error":"#N/A"}},{"$f":"MATCH(AY$3,Millwall!$Z117:AK117,0)","v":{"$error":"#N/A"}},{"$f":"MATCH(BA$3,Millwall!$Z117:AK117,0)","v":{"$error":"#N/A"}},{"$f":"MATCH(BA$3,Millwall!$Z117:AK117,0)","v":{"$error":"#N/A"}},{"$f":"MATCH(BB$3,Millwall!$Z117:AK117,0)","v":{"$error":"#N/A"}},{"$f":"MATCH(BC$3,Millwall!$Z117:AK117,0)","v":{"$error":"#N/A"}},{"$f":"MATCH(BD$3,Millwall!$Z117:AK117,0)","v":{"$error":"#N/A"}},{"$f":"MATCH(BE$3,Millwall!$Z117:AK117,0)","v":{"$error":"#N/A"}},{"$f":"MATCH(BF$3,Millwall!$Z117:AK117,0)","v":{"$error":"#N/A"}},{"$f":"MATCH(BG$3,Millwall!$Z117:AK117,0)","v":{"$error":"#N/A"}},{"$f":"MATCH(BH$3,Millwall!$Z117:AK117,0)","v":{"$error":"#N/A"}},{"$f":"MATCH(BI$3,Millwall!$Z117:AK117,0)","v":{"$error":"#N/A"}},{"$f":"MATCH(BJ$3,Millwall!$Z117:AK117,0)","v":{"$error":"#N/A"}},{"$f":"MATCH(BK$3,Millwall!$Z117:AK117,0)","v":{"$error":"#N/A"}},{"$f":"MATCH(BL$3,Millwall!$Z117:AK117,0)","v":{"$error":"#N/A"}},{"$f":"MATCH(BM$3,Millwall!$Z117:AK117,0)","v":{"$error":"#N/A"}},{"$f":"MATCH(BN$3,Millwall!$Z117:AK117,0)","v":{"$error":"#N/A"}},{"$f":"MATCH(BO$3,Millwall!$Z117:AK117,0)","v":{"$error":"#N/A"}},{"$f":"MATCH(BP$3,Millwall!$Z117:AK117,0)","v":{"$error":"#N/A"}},{"$f":"MATCH(BQ$3,Millwall!$Z117:AK117,0)","v":{"$error":"#N/A"}},{"$f":"MATCH(BR$3,Millwall!$Z117:AK117,0)","v":{"$error":"#N/A"}},{"$f":"MATCH(BS$3,Millwall!$Z117:AK117,0)","v":{"$error":"#N/A"}},{"$f":"MATCH(BT$3,Millwall!$Z117:AK117,0)","v":{"$error":"#N/A"}},{"$f":"MATCH(BU$3,Millwall!$Z117:AK117,0)","v":{"$error":"#N/A"}},{"$f":"MATCH(BV$3,Millwall!$Z117:AK117,0)","v":{"$error":"#N/A"}},{"$f":"MATCH(BW$3,Millwall!$Z117:AK117,0)","v":{"$error":"#N/A"}},{"$f":"MATCH(BX$3,Millwall!$Z117:AK117,0)","v":{"$error":"#N/A"}},{"$f":"MATCH(BY$3,Millwall!$Z117:AK117,0)","v":{"$error":"#N/A"}},{"$f":"MATCH(BZ$3,Millwall!$Z117:AK117,0)","v":{"$error":"#N/A"}},{"$f":"MATCH(CA$3,Millwall!$Z117:AK117,0)","v":{"$error":"#N/A"}},{"$f":"MATCH(CB$3,Millwall!$Z117:AK117,0)","v":{"$error":"#N/A"}},{"$f":"MATCH(CC$3,Millwall!$Z117:AK117,0)","v":{"$error":"#N/A"}},{"$f":"MATCH(CD$3,Millwall!$Z117:AK117,0)","v":{"$error":"#N/A"}},{"$f":"MATCH(CE$3,Millwall!$Z117:AK117,0)","v":{"$error":"#N/A"}}]
[null,null,1,44,null,{"$f":"Millwall!V118","v":"00:00:00"},null,{"$f":"Millwall!W118","v":"00:00:00"},{"$f":"Millwall!X118","v":"00:00:00"},{"$f":"Millwall!Y118","v":0},{"$f":"MATCH(K$4,Millwall!$Z118:$AK118,0)","v":{"$error":"#N/A"}},{"$f":"MATCH(L$4,Millwall!$Z118:$AK118,0)","v":{"$error":"#N/A"}},{"$f":"MATCH(M$4,Millwall!$Z118:$AK118,0)","v":{"$error":"#N/A"}},{"$f":"MATCH(N$4,Millwall!$Z118:$AK118,0)","v":{"$error":"#N/A"}},{"$f":"MATCH(O$4,Millwall!$Z118:$AK118,0)","v":{"$error":"#N/A"}},{"$f":"MATCH(P$4,Millwall!$Z118:$AK118,0)","v":{"$error":"#N/A"}},{"$f":"MATCH(Q$4,Millwall!$Z118:$AK118,0)","v":{"$error":"#N/A"}},{"$f":"MATCH(R$4,Millwall!$Z118:$AK118,0)","v":{"$error":"#N/A"}},{"$f":"MATCH(S$4,Millwall!$Z118:$AK118,0)","v":{"$error":"#N/A"}},{"$f":"MATCH(T$4,Millwall!$Z118:$AK118,0)","v":{"$error":"#N/A"}},{"$f":"MATCH(U$4,Millwall!$Z118:$AK118,0)","v":{"$error":"#N/A"}},{"$f":"MATCH(V$4,Millwall!$Z118:$AK118,0)","v":{"$error":"#N/A"}},{"$f":"MATCH(W$4,Millwall!$Z118:$AK118,0)","v":{"$error":"#N/A"}},{"$f":"MATCH(X$4,Millwall!$Z118:$AK118,0)","v":{"$error":"#N/A"}},{"$f":"MATCH(Y$4,Millwall!$Z118:$AK118,0)","v":{"$error":"#N/A"}},{"$f":"MATCH(Z$4,Millwall!$Z118:$AK118,0)","v":{"$error":"#N/A"}},{"$f":"MATCH(AA$4,Millwall!$Z118:$AK118,0)","v":{"$error":"#N/A"}},{"$f":"MATCH(AB$4,Millwall!$Z118:$AK118,0)","v":{"$error":"#N/A"}},{"$f":"MATCH(AC$4,Millwall!$Z118:$AK118,0)","v":{"$error":"#N/A"}},{"$f":"MATCH(AD$4,Millwall!$Z118:$AK118,0)","v":{"$error":"#N/A"}},{"$f":"MATCH(AE$4,Millwall!$Z118:$AK118,0)","v":{"$error":"#N/A"}},{"$f":"MATCH(AF$4,Millwall!$Z118:$AK118,0)","v":{"$error":"#N/A"}},{"$f":"MATCH(AG$4,Millwall!$Z118:$AK118,0)","v":{"$error":"#N/A"}},{"$f":"MATCH(AH$3,Millwall!$Z118:$AK118,0)","v":{"$error":"#N/A"}},{"$f":"MATCH(AI$3,Millwall!$Z118:$AK118,0)","v":{"$error":"#N/A"}},{"$f":"MATCH(AJ$3,Millwall!$Z118:$AK118,0)","v":{"$error":"#N/A"}},{"$f":"MATCH(AK$3,Millwall!$Z118:$AK118,0)","v":{"$error":"#N/A"}},{"$f":"MATCH(AL$3,Millwall!$Z118:$AK118,0)","v":{"$error":"#N/A"}},{"$f":"MATCH(AM$3,Millwall!$Z118:$AK118,0)","v":{"$error":"#N/A"}},{"$f":"MATCH(AN$3,Millwall!$Z118:$AK118,0)","v":{"$error":"#N/A"}},{"$f":"MATCH(AO$3,Millwall!$Z118:$AK118,0)","v":{"$error":"#N/A"}},{"$f":"MATCH(AP$3,Millwall!$Z118:$AK118,0)","v":{"$error":"#N/A"}},{"$f":"MATCH(AQ$3,Millwall!$Z118:$AK118,0)","v":{"$error":"#N/A"}},{"$f":"MATCH(AR$3,Millwall!$Z118:$AK118,0)","v":{"$error":"#N/A"}},null,null,null,null,null,{"$f":"MATCH(AX$3,Millwall!$Z118:AK118,0)","v":{"$error":"#N/A"}},{"$f":"MATCH(AY$3,Millwall!$Z118:AK118,0)","v":{"$error":"#N/A"}},{"$f":"MATCH(BA$3,Millwall!$Z118:AK118,0)","v":{"$error":"#N/A"}},{"$f":"MATCH(BA$3,Millwall!$Z118:AK118,0)","v":{"$error":"#N/A"}},{"$f":"MATCH(BB$3,Millwall!$Z118:AK118,0)","v":{"$error":"#N/A"}},{"$f":"MATCH(BC$3,Millwall!$Z118:AK118,0)","v":{"$error":"#N/A"}},{"$f":"MATCH(BD$3,Millwall!$Z118:AK118,0)","v":{"$error":"#N/A"}},{"$f":"MATCH(BE$3,Millwall!$Z118:AK118,0)","v":{"$error":"#N/A"}},{"$f":"MATCH(BF$3,Millwall!$Z118:AK118,0)","v":{"$error":"#N/A"}},{"$f":"MATCH(BG$3,Millwall!$Z118:AK118,0)","v":{"$error":"#N/A"}},{"$f":"MATCH(BH$3,Millwall!$Z118:AK118,0)","v":{"$error":"#N/A"}},{"$f":"MATCH(BI$3,Millwall!$Z118:AK118,0)","v":{"$error":"#N/A"}},{"$f":"MATCH(BJ$3,Millwall!$Z118:AK118,0)","v":{"$error":"#N/A"}},{"$f":"MATCH(BK$3,Millwall!$Z118:AK118,0)","v":{"$error":"#N/A"}},{"$f":"MATCH(BL$3,Millwall!$Z118:AK118,0)","v":{"$error":"#N/A"}},{"$f":"MATCH(BM$3,Millwall!$Z118:AK118,0)","v":{"$error":"#N/A"}},{"$f":"MATCH(BN$3,Millwall!$Z118:AK118,0)","v":{"$error":"#N/A"}},{"$f":"MATCH(BO$3,Millwall!$Z118:AK118,0)","v":{"$error":"#N/A"}},{"$f":"MATCH(BP$3,Millwall!$Z118:AK118,0)","v":{"$error":"#N/A"}},{"$f":"MATCH(BQ$3,Millwall!$Z118:AK118,0)","v":{"$error":"#N/A"}},{"$f":"MATCH(BR$3,Millwall!$Z118:AK118,0)","v":{"$error":"#N/A"}},{"$f":"MATCH(BS$3,Millwall!$Z118:AK118,0)","v":{"$error":"#N/A"}},{"$f":"MATCH(BT$3,Millwall!$Z118:AK118,0)","v":{"$error":"#N/A"}},{"$f":"MATCH(BU$3,Millwall!$Z118:AK118,0)","v":{"$error":"#N/A"}},{"$f":"MATCH(BV$3,Millwall!$Z118:AK118,0)","v":{"$error":"#N/A"}},{"$f":"MATCH(BW$3,Millwall!$Z118:AK118,0)","v":{"$error":"#N/A"}},{"$f":"MATCH(BX$3,Millwall!$Z118:AK118,0)","v":{"$error":"#N/A"}},{"$f":"MATCH(BY$3,Millwall!$Z118:AK118,0)","v":{"$error":"#N/A"}},{"$f":"MATCH(BZ$3,Millwall!$Z118:AK118,0)","v":{"$error":"#N/A"}},{"$f":"MATCH(CA$3,Millwall!$Z118:AK118,0)","v":{"$error":"#N/A"}},{"$f":"MATCH(CB$3,Millwall!$Z118:AK118,0)","v":{"$error":"#N/A"}},{"$f":"MATCH(CC$3,Millwall!$Z118:AK118,0)","v":{"$error":"#N/A"}},{"$f":"MATCH(CD$3,Millwall!$Z118:AK118,0)","v":{"$error":"#N/A"}},{"$f":"MATCH(CE$3,Millwall!$Z118:AK118,0)","v":{"$error":"#N/A"}}]
[null,null,1,45,null,{"$f":"Millwall!V122","v":"00:00:00"},null,{"$f":"Millwall!W122","v":"00:00:00"},{"$f":"Millwall!X122","v":"00:00:00"},{"$f":"Millwall!Y122","v":0},{"$f":"MATCH(K$4,Millwall!$Z119:$AK119,0)","v":{"$error":"#N/A"}},{"$f":"MATCH(L$4,Millwall!$Z119:$AK119,0)","v":{"$error":"#N/A"}},{"$f":"MATCH(M$4,Millwall!$Z119:$AK119,0)","v":{"$error":"#N/A"}},{"$f":"MATCH(N$4,Millwall!$Z119:$AK119,0)","v":{"$error":"#N/A"}},{"$f":"MATCH(O$4,Millwall!$Z119:$AK119,0)","v":{"$error":"#N/A"}},{"$f":"MATCH(P$4,Millwall!$Z119:$AK119,0)","v":{"$error":"#N/A"}},{"$f":"MATCH(Q$4,Millwall!$Z119:$AK119,0)","v":{"$error":"#N/A"}},{"$f":"MATCH(R$4,Millwall!$Z119:$AK119,0)","v":{"$error":"#N/A"}},{"$f":"MATCH(S$4,Millwall!$Z119:$AK119,0)","v":{"$error":"#N/A"}},{"$f":"MATCH(T$4,Millwall!$Z119:$AK119,0)","v":{"$error":"#N/A"}},{"$f":"MATCH(U$4,Millwall!$Z119:$AK119,0)","v":{"$error":"#N/A"}},{"$f":"MATCH(V$4,Millwall!$Z119:$AK119,0)","v":{"$error":"#N/A"}},{"$f":"MATCH(W$4,Millwall!$Z119:$AK119,0)","v":{"$error":"#N/A"}},{"$f":"MATCH(X$4,Millwall!$Z119:$AK119,0)","v":{"$error":"#N/A"}},{"$f":"MATCH(Y$4,Millwall!$Z119:$AK119,0)","v":{"$error":"#N/A"}},{"$f":"MATCH(Z$4,Millwall!$Z119:$AK119,0)","v":{"$error":"#N/A"}},{"$f":"MATCH(AA$4,Millwall!$Z119:$AK119,0)","v":{"$error":"#N/A"}},{"$f":"MATCH(AB$4,Millwall!$Z119:$AK119,0)","v":{"$error":"#N/A"}},{"$f":"MATCH(AC$4,Millwall!$Z119:$AK119,0)","v":{"$error":"#N/A"}},{"$f":"MATCH(AD$4,Millwall!$Z119:$AK119,0)","v":{"$error":"#N/A"}},{"$f":"MATCH(AE$4,Millwall!$Z119:$AK119,0)","v":{"$error":"#N/A"}},{"$f":"MATCH(AF$4,Millwall!$Z119:$AK119,0)","v":{"$error":"#N/A"}},{"$f":"MATCH(AG$4,Millwall!$Z119:$AK119,0)","v":{"$error":"#N/A"}},{"$f":"MATCH(AH$3,Millwall!$Z119:$AK119,0)","v":{"$error":"#N/A"}},{"$f":"MATCH(AI$3,Millwall!$Z119:$AK119,0)","v":{"$error":"#N/A"}},{"$f":"MATCH(AJ$3,Millwall!$Z119:$AK119,0)","v":{"$error":"#N/A"}},{"$f":"MATCH(AK$3,Millwall!$Z119:$AK119,0)","v":{"$error":"#N/A"}},{"$f":"MATCH(AL$3,Millwall!$Z119:$AK119,0)","v":{"$error":"#N/A"}},{"$f":"MATCH(AM$3,Millwall!$Z119:$AK119,0)","v":{"$error":"#N/A"}},{"$f":"MATCH(AN$3,Millwall!$Z119:$AK119,0)","v":{"$error":"#N/A"}},{"$f":"MATCH(AO$3,Millwall!$Z119:$AK119,0)","v":{"$error":"#N/A"}},{"$f":"MATCH(AP$3,Millwall!$Z119:$AK119,0)","v":{"$error":"#N/A"}},{"$f":"MATCH(AQ$3,Millwall!$Z119:$AK119,0)","v":{"$error":"#N/A"}},{"$f":"MATCH(AR$3,Millwall!$Z119:$AK119,0)","v":{"$error":"#N/A"}},null,null,null,null,null,{"$f":"MATCH(AX$3,Millwall!$Z119:AK119,0)","v":{"$error":"#N/A"}},{"$f":"MATCH(AY$3,Millwall!$Z119:AK119,0)","v":{"$error":"#N/A"}},{"$f":"MATCH(BA$3,Millwall!$Z119:AK119,0)","v":{"$error":"#N/A"}},{"$f":"MATCH(BA$3,Millwall!$Z119:AK119,0)","v":{"$error":"#N/A"}},{"$f":"MATCH(BB$3,Millwall!$Z119:AK119,0)","v":{"$error":"#N/A"}},{"$f":"MATCH(BC$3,Millwall!$Z119:AK119,0)","v":{"$error":"#N/A"}},{"$f":"MATCH(BD$3,Millwall!$Z119:AK119,0)","v":{"$error":"#N/A"}},{"$f":"MATCH(BE$3,Millwall!$Z119:AK119,0)","v":{"$error":"#N/A"}},{"$f":"MATCH(BF$3,Millwall!$Z119:AK119,0)","v":{"$error":"#N/A"}},{"$f":"MATCH(BG$3,Millwall!$Z119:AK119,0)","v":{"$error":"#N/A"}},{"$f":"MATCH(BH$3,Millwall!$Z119:AK119,0)","v":{"$error":"#N/A"}},{"$f":"MATCH(BI$3,Millwall!$Z119:AK119,0)","v":{"$error":"#N/A"}},{"$f":"MATCH(BJ$3,Millwall!$Z119:AK119,0)","v":{"$error":"#N/A"}},{"$f":"MATCH(BK$3,Millwall!$Z119:AK119,0)","v":{"$error":"#N/A"}},{"$f":"MATCH(BL$3,Millwall!$Z119:AK119,0)","v":{"$error":"#N/A"}},{"$f":"MATCH(BM$3,Millwall!$Z119:AK119,0)","v":{"$error":"#N/A"}},{"$f":"MATCH(BN$3,Millwall!$Z119:AK119,0)","v":{"$error":"#N/A"}},{"$f":"MATCH(BO$3,Millwall!$Z119:AK119,0)","v":{"$error":"#N/A"}},{"$f":"MATCH(BP$3,Millwall!$Z119:AK119,0)","v":{"$error":"#N/A"}},{"$f":"MATCH(BQ$3,Millwall!$Z119:AK119,0)","v":{"$error":"#N/A"}},{"$f":"MATCH(BR$3,Millwall!$Z119:AK119,0)","v":{"$error":"#N/A"}},{"$f":"MATCH(BS$3,Millwall!$Z119:AK119,0)","v":{"$error":"#N/A"}},{"$f":"MATCH(BT$3,Millwall!$Z119:AK119,0)","v":{"$error":"#N/A"}},{"$f":"MATCH(BU$3,Millwall!$Z119:AK119,0)","v":{"$error":"#N/A"}},{"$f":"MATCH(BV$3,Millwall!$Z119:AK119,0)","v":{"$error":"#N/A"}},{"$f":"MATCH(BW$3,Millwall!$Z119:AK119,0)","v":{"$error":"#N/A"}},{"$f":"MATCH(BX$3,Millwall!$Z119:AK119,0)","v":{"$error":"#N/A"}},{"$f":"MATCH(BY$3,Millwall!$Z119:AK119,0)","v":{"$error":"#N/A"}},{"$f":"MATCH(BZ$3,Millwall!$Z119:AK119,0)","v":{"$error":"#N/A"}},{"$f":"MATCH(CA$3,Millwall!$Z119:AK119,0)","v":{"$error":"#N/A"}},{"$f":"MATCH(CB$3,Millwall!$Z119:AK119,0)","v":{"$error":"#N/A"}},{"$f":"MATCH(CC$3,Millwall!$Z119:AK119,0)","v":{"$error":"#N/A"}},{"$f":"MATCH(CD$3,Millwall!$Z119:AK119,0)","v":{"$error":"#N/A"}},{"$f":"MATCH(CE$3,Millwall!$Z119:AK119,0)","v":{"$error":"#N/A"}}]
[null,null,{"$f":"IF(J50=0,1,0)","v":1},46,null,{"$f":"Millwall!V120","v":"00:00:00"},null,{"$f":"Millwall!W120","v":"00:00:00"},{"$f":"Millwall!X120","v":"00:00:00"},{"$f":"Millwall!Y120","v":0},{"$f":"MATCH(K$4,Millwall!$Z120:$AK120,0)","v":{"$error":"#N/A"}},{"$f":"MATCH(L$4,Millwall!$Z120:$AK120,0)","v":{"$error":"#N/A"}},{"$f":"MATCH(M$4,Millwall!$Z120:$AK120,0)","v":{"$error":"#N/A"}},{"$f":"MATCH(N$4,Millwall!$Z120:$AK120,0)","v":{"$error":"#N/A"}},{"$f":"MATCH(O$4,Millwall!$Z120:$AK120,0)","v":{"$error":"#N/A"}},{"$f":"MATCH(P$4,Millwall!$Z120:$AK120,0)","v":{"$error":"#N/A"}},{"$f":"MATCH(Q$4,Millwall!$Z120:$AK120,0)","v":{"$error":"#N/A"}},{"$f":"MATCH(R$4,Millwall!$Z120:$AK120,0)","v":{"$error":"#N/A"}},{"$f":"MATCH(S$4,Millwall!$Z120:$AK120,0)","v":{"$error":"#N/A"}},{"$f":"MATCH(T$4,Millwall!$Z120:$AK120,0)","v":{"$error":"#N/A"}},{"$f":"MATCH(U$4,Millwall!$Z120:$AK120,0)","v":{"$error":"#N/A"}},{"$f":"MATCH(V$4,Millwall!$Z120:$AK120,0)","v":{"$error":"#N/A"}},{"$f":"MATCH(W$4,Millwall!$Z120:$AK120,0)","v":{"$error":"#N/A"}},{"$f":"MATCH(X$4,Millwall!$Z120:$AK120,0)","v":{"$error":"#N/A"}},{"$f":"MATCH(Y$4,Millwall!$Z120:$AK120,0)","v":{"$error":"#N/A"}},{"$f":"MATCH(Z$4,Millwall!$Z120:$AK120,0)","v":{"$error":"#N/A"}},{"$f":"MATCH(AA$4,Millwall!$Z120:$AK120,0)","v":{"$error":"#N/A"}},{"$f":"MATCH(AB$4,Millwall!$Z120:$AK120,0)","v":{"$error":"#N/A"}},{"$f":"MATCH(AC$4,Millwall!$Z120:$AK120,0)","v":{"$error":"#N/A"}},{"$f":"MATCH(AD$4,Millwall!$Z120:$AK120,0)","v":{"$error":"#N/A"}},{"$f":"MATCH(AE$4,Millwall!$Z120:$AK120,0)","v":{"$error":"#N/A"}},{"$f":"MATCH(AF$4,Millwall!$Z120:$AK120,0)","v":{"$error":"#N/A"}},{"$f":"MATCH(AG$4,Millwall!$Z120:$AK120,0)","v":{"$error":"#N/A"}},{"$f":"MATCH(AH$3,Millwall!$Z120:$AK120,0)","v":{"$error":"#N/A"}},{"$f":"MATCH(AI$3,Millwall!$Z120:$AK120,0)","v":{"$error":"#N/A"}},{"$f":"MATCH(AJ$3,Millwall!$Z120:$AK120,0)","v":{"$error":"#N/A"}},{"$f":"MATCH(AK$3,Millwall!$Z120:$AK120,0)","v":{"$error":"#N/A"}},{"$f":"MATCH(AL$3,Millwall!$Z120:$AK120,0)","v":{"$error":"#N/A"}},{"$f":"MATCH(AM$3,Millwall!$Z120:$AK120,0)","v":{"$error":"#N/A"}},{"$f":"MATCH(AN$3,Millwall!$Z120:$AK120,0)","v":{"$error":"#N/A"}},{"$f":"MATCH(AO$3,Millwall!$Z120:$AK120,0)","v":{"$error":"#N/A"}},{"$f":"MATCH(AP$3,Millwall!$Z120:$AK120,0)","v":{"$error":"#N/A"}},{"$f":"MATCH(AQ$3,Millwall!$Z120:$AK120,0)","v":{"$error":"#N/A"}},{"$f":"MATCH(AR$3,Millwall!$Z120:$AK120,0)","v":{"$error":"#N/A"}},null,null,null,null,null,{"$f":"MATCH(AX$3,Millwall!$Z120:AK120,0)","v":{"$error":"#N/A"}},{"$f":"MATCH(AY$3,Millwall!$Z120:AK120,0)","v":{"$error":"#N/A"}},{"$f":"MATCH(BA$3,Millwall!$Z120:AK120,0)","v":{"$error":"#N/A"}},{"$f":"MATCH(BA$3,Millwall!$Z120:AK120,0)","v":{"$error":"#N/A"}},{"$f":"MATCH(BB$3,Millwall!$Z120:AK120,0)","v":{"$error":"#N/A"}},{"$f":"MATCH(BC$3,Millwall!$Z120:AK120,0)","v":{"$error":"#N/A"}},{"$f":"MATCH(BD$3,Millwall!$Z120:AK120,0)","v":{"$error":"#N/A"}},{"$f":"MATCH(BE$3,Millwall!$Z120:AK120,0)","v":{"$error":"#N/A"}},{"$f":"MATCH(BF$3,Millwall!$Z120:AK120,0)","v":{"$error":"#N/A"}},{"$f":"MATCH(BG$3,Millwall!$Z120:AK120,0)","v":{"$error":"#N/A"}},{"$f":"MATCH(BH$3,Millwall!$Z120:AK120,0)","v":{"$error":"#N/A"}},{"$f":"MATCH(BI$3,Millwall!$Z120:AK120,0)","v":{"$error":"#N/A"}},{"$f":"MATCH(BJ$3,Millwall!$Z120:AK120,0)","v":{"$error":"#N/A"}},{"$f":"MATCH(BK$3,Millwall!$Z120:AK120,0)","v":{"$error":"#N/A"}},{"$f":"MATCH(BL$3,Millwall!$Z120:AK120,0)","v":{"$error":"#N/A"}},{"$f":"MATCH(BM$3,Millwall!$Z120:AK120,0)","v":{"$error":"#N/A"}},{"$f":"MATCH(BN$3,Millwall!$Z120:AK120,0)","v":{"$error":"#N/A"}},{"$f":"MATCH(BO$3,Millwall!$Z120:AK120,0)","v":{"$error":"#N/A"}},{"$f":"MATCH(BP$3,Millwall!$Z120:AK120,0)","v":{"$error":"#N/A"}},{"$f":"MATCH(BQ$3,Millwall!$Z120:AK120,0)","v":{"$error":"#N/A"}},{"$f":"MATCH(BR$3,Millwall!$Z120:AK120,0)","v":{"$error":"#N/A"}},{"$f":"MATCH(BS$3,Millwall!$Z120:AK120,0)","v":{"$error":"#N/A"}},{"$f":"MATCH(BT$3,Millwall!$Z120:AK120,0)","v":{"$error":"#N/A"}},{"$f":"MATCH(BU$3,Millwall!$Z120:AK120,0)","v":{"$error":"#N/A"}},{"$f":"MATCH(BV$3,Millwall!$Z120:AK120,0)","v":{"$error":"#N/A"}},{"$f":"MATCH(BW$3,Millwall!$Z120:AK120,0)","v":{"$error":"#N/A"}},{"$f":"MATCH(BX$3,Millwall!$Z120:AK120,0)","v":{"$error":"#N/A"}},{"$f":"MATCH(BY$3,Millwall!$Z120:AK120,0)","v":{"$error":"#N/A"}},{"$f":"MATCH(BZ$3,Millwall!$Z120:AK120,0)","v":{"$error":"#N/A"}},{"$f":"MATCH(CA$3,Millwall!$Z120:AK120,0)","v":{"$error":"#N/A"}},{"$f":"MATCH(CB$3,Millwall!$Z120:AK120,0)","v":{"$error":"#N/A"}},{"$f":"MATCH(CC$3,Millwall!$Z120:AK120,0)","v":{"$error":"#N/A"}},{"$f":"MATCH(CD$3,Millwall!$Z120:AK120,0)","v":{"$error":"#N/A"}},{"$f":"MATCH(CE$3,Millwall!$Z120:AK120,0)","v":{"$error":"#N/A"}}]
[]
[null,null,null,null,null,null,null,null,null,"Total League Apperances",{"$f":"COUNT(K5:K50)-K53","v":26},{"$f":"COUNT(L5:L50)-L53","v":6},28,9,1,6,25,1,4,29,36,13,21,26,19,9,6,42,39,22,41,13,5,17,14,0,0,0,0,0,0,0,0,0]
[null,null,null,null,null,null,null,null,null,"Total League Substitute Appearences ",{"$f":"COUNTIF(K5:K50,\">=12\")","v":5},0,{"$f":"COUNTIF(M5:M50,\">=12\")","v":1},{"$f":"COUNTIF(N5:N50,\">=12\")","v":0},4,0,5,0,0,0,0,0,0,5,1,2,0,0,0,0,0,0,0,0,0,0,0,0,0,0,0,0,0,0]
[null,null,null,null,null,null,null,null,null,"Goals",{"$f":"Millwall!$BV$6","v":1},{"$f":"Millwall!$BV$7","v":1},{"$f":"Millwall!$BV$8","v":5},{"$f":"Millwall!$BV$9","v":0},{"$f":"Millwall!$BV$10","v":1},{"$f":"Millwall!$BV$11","v":2},{"$f":"Millwall!$BV$12","v":6},{"$f":"Millwall!$BV$13","v":0},{"$f":"Millwall!$BV$14","v":0},{"$f":"Millwall!$BV$15","v":1},{"$f":"Millwall!$BV$16","v":1},{"$f":"Millwall!$BV$17","v":1},{"$f":"Millwall!$BV$18","v":2},{"$f":"Millwall!$BV$19","v":5},{"$f":"Millwall!$BV$20","v":0},{"$f":"Millwall!$BV$21","v":0},{"$f":"Millwall!$BV$22","v":1},{"$f":"Millwall!$BV$23","v":0},{"$f":"Millwall!$BV$24","v":2},{"$f":"Millwall!$BV$25","v":2},{"$f":"Millwall!$BV$26","v":2},{"$f":"Millwall!$BV$27","v":1},{"$f":"Millwall!$BV$28","v":0},{"$f":"Millwall!$BV$29","v":6},{"$f":"Millwall!$BV$30","v":2},{"$f":"Millwall!$BV$33","v":0},{"$f":"Millwall!$BV$34","v":44},{"$f":"Millwall!$BV$35","v":0},{"$f":"Millwall!$BV$36","v":0},{"$f":"Millwall!$BV$37","v":0},{"$f":"Millwall!$BV$38","v":0},{"$f":"Millwall!$BV$39","v":0},{"$f":"Millwall!$BV$40","v":0},{"$f":"Millwall!$BV$41","v":0}]
[null,null,1]
[null,null,null,null,null,null,null,"FA Cup"]
[null,null,{"$f":"IF(J57=0,1,0)","v":0},3,null,{"$f":"Millwall!V126","v":"1975-01-04"},null,{"$f":"Millwall!W126","v":"Bury"},{"$f":"Millwall!X126","v":"(A)"},{"$f":"Millwall!Y126","v":"D 2-2"},{"$f":"MATCH(K$4,Millwall!$Z126:$AK126,0)","v":11},{"$f":"MATCH(L$4,Millwall!$Z126:$AK126,0)","v":{"$error":"#N/A"}},{"$f":"MATCH(M$4,Millwall!$Z126:$AK126,0)","v":10},{"$f":"MATCH(N$4,Millwall!$Z126:$AK126,0)","v":{"$error":"#N/A"}},{"$f":"MATCH(O$4,Millwall!$Z126:$AK126,0)","v":{"$error":"#N/A"}},{"$f":"MATCH(P$4,Millwall!$Z126:$AK126,0)","v":{"$error":"#N/A"}},{"$f":"MATCH(Q$4,Millwall!$Z126:$AK126,0)","v":9},{"$f":"MATCH(R$4,Millwall!$Z126:$AK126,0)","v":{"$error":"#N/A"}},{"$f":"MATCH(S$4,Millwall!$Z126:$AK126,0)","v":{"$error":"#N/A"}},{"$f":"MATCH(T$4,Millwall!$Z126:$AK126,0)","v":4},{"$f":"MATCH(U$4,Millwall!$Z126:$AK126,0)","v":6},{"$f":"MATCH(V$4,Millwall!$Z126:$AK126,0)","v":{"$error":"#N/A"}},{"$f":"MATCH(W$4,Millwall!$Z126:$AK126,0)","v":2},{"$f":"MATCH(X$4,Millwall!$Z126:$AK126,0)","v":12},{"$f":"MATCH(Y$4,Millwall!$Z126:$AK126,0)","v":{"$error":"#N/A"}},{"$f":"MATCH(Z$4,Millwall!$Z126:$AK126,0)","v":{"$error":"#N/A"}},{"$f":"MATCH(AA$4,Millwall!$Z126:$AK126,0)","v":{"$error":"#N/A"}},{"$f":"MATCH(AB$4,Millwall!$Z126:$AK126,0)","v":1},{"$f":"MATCH(AC$4,Millwall!$Z126:$AK126,0)","v":5},{"$f":"MATCH(AD$4,Millwall!$Z126:$AK126,0)","v":3},{"$f":"MATCH(AE$4,Millwall!$Z126:$AK126,0)","v":7},{"$f":"MATCH(AF$4,Millwall!$Z126:$AK126,0)","v":{"$error":"#N/A"}},{"$f":"MATCH(AG$4,Millwall!$Z126:$AK126,0)","v":{"$error":"#N/A"}},{"$f":"MATCH(AH$3,Millwall!$Z126:$AK126,0)","v":8},{"$f":"MATCH(AI$3,Millwall!$Z126:$AK126,0)","v":{"$error":"#N/A"}},{"$f":"MATCH(AJ$3,Millwall!$Z126:$AK126,0)","v":{"$error":"#N/A"}},{"$f":"MATCH(AK$3,Millwall!$Z126:$AK126,0)","v":{"$error":"#N/A"}},{"$f":"MATCH(AL$3,Millwall!$Z126:$AK126,0)","v":{"$error":"#N/A"}},{"$f":"MATCH(AM$3,Millwall!$Z126:$AK126,0)","v":{"$error":"#N/A"}},{"$f":"MATCH(AN$3,Millwall!$Z126:$AK126,0)","v":{"$error":"#N/A"}},{"$f":"MATCH(AO$3,Millwall!$Z126:$AK126,0)","v":{"$error":"#N/A"}},{"$f":"MATCH(AP$3,Millwall!$Z126:$AK126,0)","v":{"$error":"#N/A"}},{"$f":"MATCH(AQ$3,Millwall!$Z126:$AK126,0)","v":{"$error":"#N/A"}},{"$f":"MATCH(AR$3,Millwall!$Z126:$AK126,0)","v":{"$error":"#N/A"}},null,null,null,null,null,{"$f":"MATCH(AX$3,Millwall!$Z126:AK126,0)","v":11},{"$f":"MATCH(AY$3,Millwall!$Z126:AK126,0)","v":{"$error":"#N/A"}},{"$f":"MATCH(AZ$3,Millwall!$Z126:AK126,0)","v":{"$error":"#N/A"}},{"$f":"MATCH(BA$3,Millwall!$Z126:AK126,0)","v":{"$error":"#N/A"}},{"$f":"MATCH(BB$3,Millwall!$Z126:AK126,0)","v":{"$error":"#N/A"}},{"$f":"MATCH(BC$3,Millwall!$Z126:AK126,0)","v":{"$error":"#N/A"}},{"$f":"MATCH(BD$3,Millwall!$Z126:AK126,0)","v":{"$error":"#N/A"}},{"$f":"MATCH(BE$3,Millwall!$Z126:AK126,0)","v":{"$error":"#N/A"}},{"$f":"MATCH(BF$3,Millwall!$Z126:AK126,0)","v":{"$error":"#N/A"}},{"$f":"MATCH(BG$3,Millwall!$Z126:AK126,0)","v":{"$error":"#N/A"}},{"$f":"MATCH(BH$3,Millwall!$Z126:AK126,0)","v":{"$error":"#N/A"}},{"$f":"MATCH(BI$3,Millwall!$Z126:AK126,0)","v":{"$error":"#N/A"}},{"$f":"MATCH(BJ$3,Millwall!$Z126:AK126,0)","v":{"$error":"#N/A"}},{"$f":"MATCH(BK$3,Millwall!$Z126:AK126,0)","v":12},{"$f":"MATCH(BL$3,Millwall!$Z126:AK126,0)","v":{"$error":"#N/A"}},{"$f":"MATCH(BM$3,Millwall!$Z126:AK126,0)","v":{"$error":"#N/A"}},{"$f":"MATCH(BN$3,Millwall!$Z126:AK126,0)","v":{"$error":"#N/A"}},{"$f":"MATCH(BO$3,Millwall!$Z126:AK126,0)","v":{"$error":"#N/A"}},{"$f":"MATCH(BP$3,Millwall!$Z126:AK126,0)","v":{"$error":"#N/A"}},{"$f":"MATCH(BQ$3,Millwall!$Z126:AK126,0)","v":{"$error":"#N/A"}},{"$f":"MATCH(BR$3,Millwall!$Z126:AK126,0)","v":{"$error":"#N/A"}},{"$f":"MATCH(BS$3,Millwall!$Z126:AK126,0)","v":{"$error":"#N/A"}},{"$f":"MATCH(BT$3,Millwall!$Z126:AK126,0)","v":{"$error":"#N/A"}},{"$f":"MATCH(BU$3,Millwall!$Z126:AK126,0)","v":{"$error":"#N/A"}},{"$f":"MATCH(BV$3,Millwall!$Z126:AK126,0)","v":{"$error":"#N/A"}},{"$f":"MATCH(BW$3,Millwall!$Z126:AK126,0)","v":{"$error":"#N/A"}},{"$f":"MATCH(BX$3,Millwall!$Z126:AK126,0)","v":{"$error":"#N/A"}},{"$f":"MATCH(BY$3,Millwall!$Z126:AK126,0)","v":{"$error":"#N/A"}},{"$f":"MATCH(BZ$3,Millwall!$Z126:AK126,0)","v":{"$error":"#N/A"}},{"$f":"MATCH(CA$3,Millwall!$Z126:AK126,0)","v":{"$error":"#N/A"}},{"$f":"MATCH(CB$3,Millwall!$Z126:AK126,0)","v":{"$error":"#N/A"}},{"$f":"MATCH(CC$3,Millwall!$Z126:AK126,0)","v":{"$error":"#N/A"}},{"$f":"MATCH(CD$3,Millwall!$Z126:AK126,0)","v":{"$error":"#N/A"}},{"$f":"MATCH(CE$3,Millwall!$Z126:AK126,0)","v":{"$error":"#N/A"}}]
[null,null,0,"3R",null,{"$f":"Millwall!V127","v":"1975-01-07"},null,{"$f":"Millwall!W127","v":"Bury"},{"$f":"Millwall!X127","v":"(H)"},{"$f":"Millwall!Y127","v":"D 1-1 *"},{"$f":"MATCH(K$4,Millwall!$Z127:$AK127,0)","v":12},{"$f":"MATCH(L$4,Millwall!$Z127:$AK127,0)","v":{"$error":"#N/A"}},{"$f":"MATCH(M$4,Millwall!$Z127:$AK127,0)","v":8},{"$f":"MATCH(N$4,Millwall!$Z127:$AK127,0)","v":{"$error":"#N/A"}},{"$f":"MATCH(O$4,Millwall!$Z127:$AK127,0)","v":{"$error":"#N/A"}},{"$f":"MATCH(P$4,Millwall!$Z127:$AK127,0)","v":{"$error":"#N/A"}},{"$f":"MATCH(Q$4,Millwall!$Z127:$AK127,0)","v":9},{"$f":"MATCH(R$4,Millwall!$Z127:$AK127,0)","v":{"$error":"#N/A"}},{"$f":"MATCH(S$4,Millwall!$Z127:$AK127,0)","v":{"$error":"#N/A"}},{"$f":"MATCH(T$4,Millwall!$Z127:$AK127,0)","v":2},{"$f":"MATCH(U$4,Millwall!$Z127:$AK127,0)","v":4},{"$f":"MATCH(V$4,Millwall!$Z127:$AK127,0)","v":{"$error":"#N/A"}},{"$f":"MATCH(W$4,Millwall!$Z127:$AK127,0)","v":7},{"$f":"MATCH(X$4,Millwall!$Z127:$AK127,0)","v":11},{"$f":"MATCH(Y$4,Millwall!$Z127:$AK127,0)","v":{"$error":"#N/A"}},{"$f":"MATCH(Z$4,Millwall!$Z127:$AK127,0)","v":{"$error":"#N/A"}},{"$f":"MATCH(AA$4,Millwall!$Z127:$AK127,0)","v":{"$error":"#N/A"}},{"$f":"MATCH(AB$4,Millwall!$Z127:$AK127,0)","v":1},{"$f":"MATCH(AC$4,Millwall!$Z127:$AK127,0)","v":5},{"$f":"MATCH(AD$4,Millwall!$Z127:$AK127,0)","v":3},{"$f":"MATCH(AE$4,Millwall!$Z127:$AK127,0)","v":6},{"$f":"MATCH(AF$4,Millwall!$Z127:$AK127,0)","v":{"$error":"#N/A"}},{"$f":"MATCH(AG$4,Millwall!$Z127:$AK127,0)","v":{"$error":"#N/A"}},{"$f":"MATCH(AH$3,Millwall!$Z127:$AK127,0)","v":10},{"$f":"MATCH(AI$3,Millwall!$Z127:$AK127,0)","v":{"$error":"#N/A"}},{"$f":"MATCH(AJ$3,Millwall!$Z127:$AK127,0)","v":{"$error":"#N/A"}},{"$f":"MATCH(AK$3,Millwall!$Z127:$AK127,0)","v":{"$error":"#N/A"}},{"$f":"MATCH(AL$3,Millwall!$Z127:$AK127,0)","v":{"$error":"#N/A"}},{"$f":"MATCH(AM$3,Millwall!$Z127:$AK127,0)","v":{"$error":"#N/A"}},{"$f":"MATCH(AN$3,Millwall!$Z127:$AK127,0)","v":{"$error":"#N/A"}},{"$f":"MATCH(AO$3,Millwall!$Z127:$AK127,0)","v":{"$error":"#N/A"}},{"$f":"MATCH(AP$3,Millwall!$Z127:$AK127,0)","v":{"$error":"#N/A"}},{"$f":"MATCH(AQ$3,Millwall!$Z127:$AK127,0)","v":{"$error":"#N/A"}},{"$f":"MATCH(AR$3,Millwall!$Z127:$AK127,0)","v":{"$error":"#N/A"}},null,null,null,null,null,{"$f":"MATCH(AX$3,Millwall!$Z127:AK127,0)","v":12},{"$f":"MATCH(AY$3,Millwall!$Z127:AK127,0)","v":{"$error":"#N/A"}},{"$f":"MATCH(AZ$3,Millwall!$Z127:AK127,0)","v":{"$error":"#N/A"}},{"$f":"MATCH(BA$3,Millwall!$Z127:AK127,0)","v":{"$error":"#N/A"}},{"$f":"MATCH(BB$3,Millwall!$Z127:AK127,0)","v":{"$error":"#N/A"}},{"$f":"MATCH(BC$3,Millwall!$Z127:AK127,0)","v":{"$error":"#N/A"}},{"$f":"MATCH(BD$3,Millwall!$Z127:AK127,0)","v":{"$error":"#N/A"}},{"$f":"MATCH(BE$3,Millwall!$Z127:AK127,0)","v":{"$error":"#N/A"}},{"$f":"MATCH(BF$3,Millwall!$Z127:AK127,0)","v":{"$error":"#N/A"}},{"$f":"MATCH(BG$3,Millwall!$Z127:AK127,0)","v":{"$error":"#N/A"}},{"$f":"MATCH(BH$3,Millwall!$Z127:AK127,0)","v":{"$error":"#N/A"}},{"$f":"MATCH(BI$3,Millwall!$Z127:AK127,0)","v":{"$error":"#N/A"}},{"$f":"MATCH(BJ$3,Millwall!$Z127:AK127,0)","v":{"$error":"#N/A"}},{"$f":"MATCH(BK$3,Millwall!$Z127:AK127,0)","v":{"$error":"#N/A"}},{"$f":"MATCH(BL$3,Millwall!$Z127:AK127,0)","v":{"$error":"#N/A"}},{"$f":"MATCH(BM$3,Millwall!$Z127:AK127,0)","v":{"$error":"#N/A"}},{"$f":"MATCH(BN$3,Millwall!$Z127:AK127,0)","v":{"$error":"#N/A"}},{"$f":"MATCH(BO$3,Millwall!$Z127:AK127,0)","v":{"$error":"#N/A"}},{"$f":"MATCH(BP$3,Millwall!$Z127:AK127,0)","v":{"$error":"#N/A"}},{"$f":"MATCH(BQ$3,Millwall!$Z127:AK127,0)","v":{"$error":"#N/A"}},{"$f":"MATCH(BR$3,Millwall!$Z127:AK127,0)","v":6},{"$f":"MATCH(BS$3,Millwall!$Z127:AK127,0)","v":{"$error":"#N/A"}},{"$f":"MATCH(BT$3,Millwall!$Z127:AK127,0)","v":{"$error":"#N/A"}},{"$f":"MATCH(BU$3,Millwall!$Z127:AK127,0)","v":{"$error":"#N/A"}},{"$f":"MATCH(BV$3,Millwall!$Z127:AK127,0)","v":{"$error":"#N/A"}},{"$f":"MATCH(BW$3,Millwall!$Z127:AK127,0)","v":{"$error":"#N/A"}},{"$f":"MATCH(BX$3,Millwall!$Z127:AK127,0)","v":{"$error":"#N/A"}},{"$f":"MATCH(BY$3,Millwall!$Z127:AK127,0)","v":{"$error":"#N/A"}},{"$f":"MATCH(BZ$3,Millwall!$Z127:AK127,0)","v":{"$error":"#N/A"}},{"$f":"MATCH(CA$3,Millwall!$Z127:AK127,0)","v":{"$error":"#N/A"}},{"$f":"MATCH(CB$3,Millwall!$Z127:AK127,0)","v":{"$error":"#N/A"}},{"$f":"MATCH(CC$3,Millwall!$Z127:AK127,0)","v":{"$error":"#N/A"}},{"$f":"MATCH(CD$3,Millwall!$Z127:AK127,0)","v":{"$error":"#N/A"}},{"$f":"MATCH(CE$3,Millwall!$Z127:AK127,0)","v":{"$error":"#N/A"}}]
[null,null,0,"3R",null,{"$f":"Millwall!V128","v":"1975-01-13"},null,{"$f":"Millwall!W128","v":"Bury"},{"$f":"Millwall!X128","v":"(N)"},{"$f":"Millwall!Y128","v":"L 0-2"},{"$f":"MATCH(K$4,Millwall!$Z128:$AK128,0)","v":7},{"$f":"MATCH(L$4,Millwall!$Z128:$AK128,0)","v":{"$error":"#N/A"}},{"$f":"MATCH(M$4,Millwall!$Z128:$AK128,0)","v":12},{"$f":"MATCH(N$4,Millwall!$Z128:$AK128,0)","v":{"$error":"#N/A"}},{"$f":"MATCH(O$4,Millwall!$Z128:$AK128,0)","v":{"$error":"#N/A"}},{"$f":"MATCH(P$4,Millwall!$Z128:$AK128,0)","v":{"$error":"#N/A"}},{"$f":"MATCH(Q$4,Millwall!$Z128:$AK128,0)","v":9},{"$f":"MATCH(R$4,Millwall!$Z128:$AK128,0)","v":{"$error":"#N/A"}},{"$f":"MATCH(S$4,Millwall!$Z128:$AK128,0)","v":{"$error":"#N/A"}},{"$f":"MATCH(T$4,Millwall!$Z128:$AK128,0)","v":{"$error":"#N/A"}},{"$f":"MATCH(U$4,Millwall!$Z128:$AK128,0)","v":4},{"$f":"MATCH(V$4,Millwall!$Z128:$AK128,0)","v":{"$error":"#N/A"}},{"$f":"MATCH(W$4,Millwall!$Z128:$AK128,0)","v":2},{"$f":"MATCH(X$4,Millwall!$Z128:$AK128,0)","v":11},{"$f":"MATCH(Y$4,Millwall!$Z128:$AK128,0)","v":8},{"$f":"MATCH(Z$4,Millwall!$Z128:$AK128,0)","v":{"$error":"#N/A"}},{"$f":"MATCH(AA$4,Millwall!$Z128:$AK128,0)","v":{"$error":"#N/A"}},{"$f":"MATCH(AB$4,Millwall!$Z128:$AK128,0)","v":1},{"$f":"MATCH(AC$4,Millwall!$Z128:$AK128,0)","v":5},{"$f":"MATCH(AD$4,Millwall!$Z128:$AK128,0)","v":3},{"$f":"MATCH(AE$4,Millwall!$Z128:$AK128,0)","v":6},{"$f":"MATCH(AF$4,Millwall!$Z128:$AK128,0)","v":{"$error":"#N/A"}},{"$f":"MATCH(AG$4,Millwall!$Z128:$AK128,0)","v":{"$error":"#N/A"}},{"$f":"MATCH(AH$3,Millwall!$Z128:$AK128,0)","v":10},{"$f":"MATCH(AI$3,Millwall!$Z128:$AK128,0)","v":{"$error":"#N/A"}},{"$f":"MATCH(AJ$3,Millwall!$Z128:$AK128,0)","v":{"$error":"#N/A"}},{"$f":"MATCH(AK$3,Millwall!$Z128:$AK128,0)","v":{"$error":"#N/A"}},{"$f":"MATCH(AL$3,Millwall!$Z128:$AK128,0)","v":{"$error":"#N/A"}},{"$f":"MATCH(AM$3,Millwall!$Z128:$AK128,0)","v":{"$error":"#N/A"}},{"$f":"MATCH(AN$3,Millwall!$Z128:$AK128,0)","v":{"$error":"#N/A"}},{"$f":"MATCH(AO$3,Millwall!$Z128:$AK128,0)","v":{"$error":"#N/A"}},{"$f":"MATCH(AP$3,Millwall!$Z128:$AK128,0)","v":{"$error":"#N/A"}},{"$f":"MATCH(AQ$3,Millwall!$Z128:$AK128,0)","v":{"$error":"#N/A"}},{"$f":"MATCH(AR$3,Millwall!$Z128:$AK128,0)","v":{"$error":"#N/A"}},null,null,null,null,null,{"$f":"MATCH(AX$3,Millwall!$Z128:AK128,0)","v":{"$error":"#N/A"}},{"$f":"MATCH(AY$3,Millwall!$Z128:AK128,0)","v":{"$error":"#N/A"}},{"$f":"MATCH(AZ$3,Millwall!$Z128:AK128,0)","v":12},{"$f":"MATCH(BA$3,Millwall!$Z128:AK128,0)","v":{"$error":"#N/A"}},{"$f":"MATCH(BB$3,Millwall!$Z128:AK128,0)","v":{"$error":"#N/A"}},{"$f":"MATCH(BC$3,Millwall!$Z128:AK128,0)","v":{"$error":"#N/A"}},{"$f":"MATCH(BD$3,Millwall!$Z128:AK128,0)","v":9},{"$f":"MATCH(BE$3,Millwall!$Z128:AK128,0)","v":{"$error":"#N/A"}},{"$f":"MATCH(BF$3,Millwall!$Z128:AK128,0)","v":{"$error":"#N/A"}},{"$f":"MATCH(BG$3,Millwall!$Z128:AK128,0)","v":{"$error":"#N/A"}},{"$f":"MATCH(BH$3,Millwall!$Z128:AK128,0)","v":{"$error":"#N/A"}},{"$f":"MATCH(BI$3,Millwall!$Z128:AK128,0)","v":{"$error":"#N/A"}},{"$f":"MATCH(BJ$3,Millwall!$Z128:AK128,0)","v":{"$error":"#N/A"}},{"$f":"MATCH(BK$3,Millwall!$Z128:AK128,0)","v":{"$error":"#N/A"}},{"$f":"MATCH(BL$3,Millwall!$Z128:AK128,0)","v":{"$error":"#N/A"}},{"$f":"MATCH(BM$3,Millwall!$Z128:AK128,0)","v":{"$error":"#N/A"}},{"$f":"MATCH(BN$3,Millwall!$Z128:AK128,0)","v":{"$error":"#N/A"}},{"$f":"MATCH(BO$3,Millwall!$Z128:AK128,0)","v":{"$error":"#N/A"}},{"$f":"MATCH(BP$3,Millwall!$Z128:AK128,0)","v":{"$error":"#N/A"}},{"$f":"MATCH(BQ$3,Millwall!$Z128:AK128,0)","v":{"$error":"#N/A"}},{"$f":"MATCH(BR$3,Millwall!$Z128:AK128,0)","v":{"$error":"#N/A"}},{"$f":"MATCH(BS$3,Millwall!$Z128:AK128,0)","v":{"$error":"#N/A"}},{"$f":"MATCH(BT$3,Millwall!$Z128:AK128,0)","v":{"$error":"#N/A"}},{"$f":"MATCH(BU$3,Millwall!$Z128:AK128,0)","v":{"$error":"#N/A"}},{"$f":"MATCH(BV$3,Millwall!$Z128:AK128,0)","v":{"$error":"#N/A"}},{"$f":"MATCH(BW$3,Millwall!$Z128:AK128,0)","v":{"$error":"#N/A"}},{"$f":"MATCH(BX$3,Millwall!$Z128:AK128,0)","v":{"$error":"#N/A"}},{"$f":"MATCH(BY$3,Millwall!$Z128:AK128,0)","v":{"$error":"#N/A"}},{"$f":"MATCH(BZ$3,Millwall!$Z128:AK128,0)","v":{"$error":"#N/A"}},{"$f":"MATCH(CA$3,Millwall!$Z128:AK128,0)","v":{"$error":"#N/A"}},{"$f":"MATCH(CB$3,Millwall!$Z128:AK128,0)","v":{"$error":"#N/A"}},{"$f":"MATCH(CC$3,Millwall!$Z128:AK128,0)","v":{"$error":"#N/A"}},{"$f":"MATCH(CD$3,Millwall!$Z128:AK128,0)","v":{"$error":"#N/A"}},{"$f":"MATCH(CE$3,Millwall!$Z128:AK128,0)","v":{"$error":"#N/A"}}]
[null,null,1,null,null,{"$f":"Millwall!V129","v":"00:00:00"},null,{"$f":"Millwall!W129","v":"00:00:00"},{"$f":"Millwall!X129","v":"00:00:00"},{"$f":"Millwall!Y129","v":0},{"$f":"MATCH(K$4,Millwall!$Z129:$AK129,0)","v":{"$error":"#N/A"}},{"$f":"MATCH(L$4,Millwall!$Z129:$AK129,0)","v":{"$error":"#N/A"}},{"$f":"MATCH(M$4,Millwall!$Z129:$AK129,0)","v":{"$error":"#N/A"}},{"$f":"MATCH(N$4,Millwall!$Z129:$AK129,0)","v":{"$error":"#N/A"}},{"$f":"MATCH(O$4,Millwall!$Z129:$AK129,0)","v":{"$error":"#N/A"}},{"$f":"MATCH(P$4,Millwall!$Z129:$AK129,0)","v":{"$error":"#N/A"}},{"$f":"MATCH(Q$4,Millwall!$Z129:$AK129,0)","v":{"$error":"#N/A"}},{"$f":"MATCH(R$4,Millwall!$Z129:$AK129,0)","v":{"$error":"#N/A"}},{"$f":"MATCH(S$4,Millwall!$Z129:$AK129,0)","v":{"$error":"#N/A"}},{"$f":"MATCH(T$4,Millwall!$Z129:$AK129,0)","v":{"$error":"#N/A"}},{"$f":"MATCH(U$4,Millwall!$Z129:$AK129,0)","v":{"$error":"#N/A"}},{"$f":"MATCH(V$4,Millwall!$Z129:$AK129,0)","v":{"$error":"#N/A"}},{"$f":"MATCH(W$4,Millwall!$Z129:$AK129,0)","v":{"$error":"#N/A"}},{"$f":"MATCH(X$4,Millwall!$Z129:$AK129,0)","v":{"$error":"#N/A"}},{"$f":"MATCH(Y$4,Millwall!$Z129:$AK129,0)","v":{"$error":"#N/A"}},{"$f":"MATCH(Z$4,Millwall!$Z129:$AK129,0)","v":{"$error":"#N/A"}},{"$f":"MATCH(AA$4,Millwall!$Z129:$AK129,0)","v":{"$error":"#N/A"}},{"$f":"MATCH(AB$4,Millwall!$Z129:$AK129,0)","v":{"$error":"#N/A"}},{"$f":"MATCH(AC$4,Millwall!$Z129:$AK129,0)","v":{"$error":"#N/A"}},{"$f":"MATCH(AD$4,Millwall!$Z129:$AK129,0)","v":{"$error":"#N/A"}},{"$f":"MATCH(AE$4,Millwall!$Z129:$AK129,0)","v":{"$error":"#N/A"}},{"$f":"MATCH(AF$4,Millwall!$Z129:$AK129,0)","v":{"$error":"#N/A"}},{"$f":"MATCH(AG$4,Millwall!$Z129:$AK129,0)","v":{"$error":"#N/A"}},{"$f":"MATCH(AH$3,Millwall!$Z129:$AK129,0)","v":{"$error":"#N/A"}},{"$f":"MATCH(AI$3,Millwall!$Z129:$AK129,0)","v":{"$error":"#N/A"}},{"$f":"MATCH(AJ$3,Millwall!$Z129:$AK129,0)","v":{"$error":"#N/A"}},{"$f":"MATCH(AK$3,Millwall!$Z129:$AK129,0)","v":{"$error":"#N/A"}},{"$f":"MATCH(AL$3,Millwall!$Z129:$AK129,0)","v":{"$error":"#N/A"}},{"$f":"MATCH(AM$3,Millwall!$Z129:$AK129,0)","v":{"$error":"#N/A"}},{"$f":"MATCH(AN$3,Millwall!$Z129:$AK129,0)","v":{"$error":"#N/A"}},{"$f":"MATCH(AO$3,Millwall!$Z129:$AK129,0)","v":{"$error":"#N/A"}},{"$f":"MATCH(AP$3,Millwall!$Z129:$AK129,0)","v":{"$error":"#N/A"}},{"$f":"MATCH(AQ$3,Millwall!$Z129:$AK129,0)","v":{"$error":"#N/A"}},{"$f":"MATCH(AR$3,Millwall!$Z129:$AK129,0)","v":{"$error":"#N/A"}},null,null,null,null,null,{"$f":"MATCH(AX$3,Millwall!$Z129:AK129,0)","v":{"$error":"#N/A"}},{"$f":"MATCH(AY$3,Millwall!$Z129:AK129,0)","v":{"$error":"#N/A"}},{"$f":"MATCH(AZ$3,Millwall!$Z129:AK129,0)","v":{"$error":"#N/A"}},{"$f":"MATCH(BA$3,Millwall!$Z129:AK129,0)","v":{"$error":"#N/A"}},{"$f":"MATCH(BB$3,Millwall!$Z129:AK129,0)","v":{"$error":"#N/A"}},{"$f":"MATCH(BC$3,Millwall!$Z129:AK129,0)","v":{"$error":"#N/A"}},{"$f":"MATCH(BD$3,Millwall!$Z129:AK129,0)","v":{"$error":"#N/A"}},{"$f":"MATCH(BE$3,Millwall!$Z129:AK129,0)","v":{"$error":"#N/A"}},{"$f":"MATCH(BF$3,Millwall!$Z129:AK129,0)","v":{"$error":"#N/A"}},{"$f":"MATCH(BG$3,Millwall!$Z129:AK129,0)","v":{"$error":"#N/A"}},{"$f":"MATCH(BH$3,Millwall!$Z129:AK129,0)","v":{"$error":"#N/A"}},{"$f":"MATCH(BI$3,Millwall!$Z129:AK129,0)","v":{"$error":"#N/A"}},{"$f":"MATCH(BJ$3,Millwall!$Z129:AK129,0)","v":{"$error":"#N/A"}},{"$f":"MATCH(BK$3,Millwall!$Z129:AK129,0)","v":{"$error":"#N/A"}},{"$f":"MATCH(BL$3,Millwall!$Z129:AK129,0)","v":{"$error":"#N/A"}},{"$f":"MATCH(BM$3,Millwall!$Z129:AK129,0)","v":{"$error":"#N/A"}},{"$f":"MATCH(BN$3,Millwall!$Z129:AK129,0)","v":{"$error":"#N/A"}},{"$f":"MATCH(BO$3,Millwall!$Z129:AK129,0)","v":{"$error":"#N/A"}},{"$f":"MATCH(BP$3,Millwall!$Z129:AK129,0)","v":{"$error":"#N/A"}},{"$f":"MATCH(BQ$3,Millwall!$Z129:AK129,0)","v":{"$error":"#N/A"}},{"$f":"MATCH(BR$3,Millwall!$Z129:AK129,0)","v":{"$error":"#N/A"}},{"$f":"MATCH(BS$3,Millwall!$Z129:AK129,0)","v":{"$error":"#N/A"}},{"$f":"MATCH(BT$3,Millwall!$Z129:AK129,0)","v":{"$error":"#N/A"}},{"$f":"MATCH(BU$3,Millwall!$Z129:AK129,0)","v":{"$error":"#N/A"}},{"$f":"MATCH(BV$3,Millwall!$Z129:AK129,0)","v":{"$error":"#N/A"}},{"$f":"MATCH(BW$3,Millwall!$Z129:AK129,0)","v":{"$error":"#N/A"}},{"$f":"MATCH(BX$3,Millwall!$Z129:AK129,0)","v":{"$error":"#N/A"}},{"$f":"MATCH(BY$3,Millwall!$Z129:AK129,0)","v":{"$error":"#N/A"}},{"$f":"MATCH(BZ$3,Millwall!$Z129:AK129,0)","v":{"$error":"#N/A"}},{"$f":"MATCH(CA$3,Millwall!$Z129:AK129,0)","v":{"$error":"#N/A"}},{"$f":"MATCH(CB$3,Millwall!$Z129:AK129,0)","v":{"$error":"#N/A"}},{"$f":"MATCH(CC$3,Millwall!$Z129:AK129,0)","v":{"$error":"#N/A"}},{"$f":"MATCH(CD$3,Millwall!$Z129:AK129,0)","v":{"$error":"#N/A"}},{"$f":"MATCH(CE$3,Millwall!$Z129:AK129,0)","v":{"$error":"#N/A"}}]
[null,null,1,null,null,{"$f":"Millwall!V130","v":"00:00:00"},null,{"$f":"Millwall!W130","v":"00:00:00"},{"$f":"Millwall!X130","v":"00:00:00"},{"$f":"Millwall!Y130","v":0},{"$f":"MATCH(K$4,Millwall!$Z130:$AK130,0)","v":{"$error":"#N/A"}},{"$f":"MATCH(L$4,Millwall!$Z130:$AK130,0)","v":{"$error":"#N/A"}},{"$f":"MATCH(M$4,Millwall!$Z130:$AK130,0)","v":{"$error":"#N/A"}},{"$f":"MATCH(N$4,Millwall!$Z130:$AK130,0)","v":{"$error":"#N/A"}},{"$f":"MATCH(O$4,Millwall!$Z130:$AK130,0)","v":{"$error":"#N/A"}},{"$f":"MATCH(P$4,Millwall!$Z130:$AK130,0)","v":{"$error":"#N/A"}},{"$f":"MATCH(Q$4,Millwall!$Z130:$AK130,0)","v":{"$error":"#N/A"}},{"$f":"MATCH(R$4,Millwall!$Z130:$AK130,0)","v":{"$error":"#N/A"}},{"$f":"MATCH(S$4,Millwall!$Z130:$AK130,0)","v":{"$error":"#N/A"}},{"$f":"MATCH(T$4,Millwall!$Z130:$AK130,0)","v":{"$error":"#N/A"}},{"$f":"MATCH(U$4,Millwall!$Z130:$AK130,0)","v":{"$error":"#N/A"}},{"$f":"MATCH(V$4,Millwall!$Z130:$AK130,0)","v":{"$error":"#N/A"}},{"$f":"MATCH(W$4,Millwall!$Z130:$AK130,0)","v":{"$error":"#N/A"}},{"$f":"MATCH(X$4,Millwall!$Z130:$AK130,0)","v":{"$error":"#N/A"}},{"$f":"MATCH(Y$4,Millwall!$Z130:$AK130,0)","v":{"$error":"#N/A"}},{"$f":"MATCH(Z$4,Millwall!$Z130:$AK130,0)","v":{"$error":"#N/A"}},{"$f":"MATCH(AA$4,Millwall!$Z130:$AK130,0)","v":{"$error":"#N/A"}},{"$f":"MATCH(AB$4,Millwall!$Z130:$AK130,0)","v":{"$error":"#N/A"}},{"$f":"MATCH(AC$4,Millwall!$Z130:$AK130,0)","v":{"$error":"#N/A"}},{"$f":"MATCH(AD$4,Millwall!$Z130:$AK130,0)","v":{"$error":"#N/A"}},{"$f":"MATCH(AE$4,Millwall!$Z130:$AK130,0)","v":{"$error":"#N/A"}},{"$f":"MATCH(AF$4,Millwall!$Z130:$AK130,0)","v":{"$error":"#N/A"}},{"$f":"MATCH(AG$4,Millwall!$Z130:$AK130,0)","v":{"$error":"#N/A"}},{"$f":"MATCH(AH$3,Millwall!$Z130:$AK130,0)","v":{"$error":"#N/A"}},{"$f":"MATCH(AI$3,Millwall!$Z130:$AK130,0)","v":{"$error":"#N/A"}},{"$f":"MATCH(AJ$3,Millwall!$Z130:$AK130,0)","v":{"$error":"#N/A"}},{"$f":"MATCH(AK$3,Millwall!$Z130:$AK130,0)","v":{"$error":"#N/A"}},{"$f":"MATCH(AL$3,Millwall!$Z130:$AK130,0)","v":{"$error":"#N/A"}},{"$f":"MATCH(AM$3,Millwall!$Z130:$AK130,0)","v":{"$error":"#N/A"}},{"$f":"MATCH(AN$3,Millwall!$Z130:$AK130,0)","v":{"$error":"#N/A"}},{"$f":"MATCH(AO$3,Millwall!$Z130:$AK130,0)","v":{"$error":"#N/A"}},{"$f":"MATCH(AP$3,Millwall!$Z130:$AK130,0)","v":{"$error":"#N/A"}},{"$f":"MATCH(AQ$3,Millwall!$Z130:$AK130,0)","v":{"$error":"#N/A"}},{"$f":"MATCH(AR$3,Millwall!$Z130:$AK130,0)","v":{"$error":"#N/A"}},null,null,null,null,null,{"$f":"MATCH(AX$3,Millwall!$Z130:AK130,0)","v":{"$error":"#N/A"}},{"$f":"MATCH(AY$3,Millwall!$Z130:AK130,0)","v":{"$error":"#N/A"}},{"$f":"MATCH(AZ$3,Millwall!$Z130:AK130,0)","v":{"$error":"#N/A"}},{"$f":"MATCH(BA$3,Millwall!$Z130:AK130,0)","v":{"$error":"#N/A"}},{"$f":"MATCH(BB$3,Millwall!$Z130:AK130,0)","v":{"$error":"#N/A"}},{"$f":"MATCH(BC$3,Millwall!$Z130:AK130,0)","v":{"$error":"#N/A"}},{"$f":"MATCH(BD$3,Millwall!$Z130:AK130,0)","v":{"$error":"#N/A"}},{"$f":"MATCH(BE$3,Millwall!$Z130:AK130,0)","v":{"$error":"#N/A"}},{"$f":"MATCH(BF$3,Millwall!$Z130:AK130,0)","v":{"$error":"#N/A"}},{"$f":"MATCH(BG$3,Millwall!$Z130:AK130,0)","v":{"$error":"#N/A"}},{"$f":"MATCH(BH$3,Millwall!$Z130:AK130,0)","v":{"$error":"#N/A"}},{"$f":"MATCH(BI$3,Millwall!$Z130:AK130,0)","v":{"$error":"#N/A"}},{"$f":"MATCH(BJ$3,Millwall!$Z130:AK130,0)","v":{"$error":"#N/A"}},{"$f":"MATCH(BK$3,Millwall!$Z130:AK130,0)","v":{"$error":"#N/A"}},{"$f":"MATCH(BL$3,Millwall!$Z130:AK130,0)","v":{"$error":"#N/A"}},{"$f":"MATCH(BM$3,Millwall!$Z130:AK130,0)","v":{"$error":"#N/A"}},{"$f":"MATCH(BN$3,Millwall!$Z130:AK130,0)","v":{"$error":"#N/A"}},{"$f":"MATCH(BO$3,Millwall!$Z130:AK130,0)","v":{"$error":"#N/A"}},{"$f":"MATCH(BP$3,Millwall!$Z130:AK130,0)","v":{"$error":"#N/A"}},{"$f":"MATCH(BQ$3,Millwall!$Z130:AK130,0)","v":{"$error":"#N/A"}},{"$f":"MATCH(BR$3,Millwall!$Z130:AK130,0)","v":{"$error":"#N/A"}},{"$f":"MATCH(BS$3,Millwall!$Z130:AK130,0)","v":{"$error":"#N/A"}},{"$f":"MATCH(BT$3,Millwall!$Z130:AK130,0)","v":{"$error":"#N/A"}},{"$f":"MATCH(BU$3,Millwall!$Z130:AK130,0)","v":{"$error":"#N/A"}},{"$f":"MATCH(BV$3,Millwall!$Z130:AK130,0)","v":{"$error":"#N/A"}},{"$f":"MATCH(BW$3,Millwall!$Z130:AK130,0)","v":{"$error":"#N/A"}},{"$f":"MATCH(BX$3,Millwall!$Z130:AK130,0)","v":{"$error":"#N/A"}},{"$f":"MATCH(BY$3,Millwall!$Z130:AK130,0)","v":{"$error":"#N/A"}},{"$f":"MATCH(BZ$3,Millwall!$Z130:AK130,0)","v":{"$error":"#N/A"}},{"$f":"MATCH(CA$3,Millwall!$Z130:AK130,0)","v":{"$error":"#N/A"}},{"$f":"MATCH(CB$3,Millwall!$Z130:AK130,0)","v":{"$error":"#N/A"}},{"$f":"MATCH(CC$3,Millwall!$Z130:AK130,0)","v":{"$error":"#N/A"}},{"$f":"MATCH(CD$3,Millwall!$Z130:AK130,0)","v":{"$error":"#N/A"}},{"$f":"MATCH(CE$3,Millwall!$Z130:AK130,0)","v":{"$error":"#N/A"}}]
[null,null,1,null,null,{"$f":"Millwall!V131","v":"00:00:00"},null,{"$f":"Millwall!W131","v":"00:00:00"},{"$f":"Millwall!X131","v":"00:00:00"},{"$f":"Millwall!Y131","v":0},{"$f":"MATCH(K$4,Millwall!$Z131:$AK131,0)","v":{"$error":"#N/A"}},{"$f":"MATCH(L$4,Millwall!$Z131:$AK131,0)","v":{"$error":"#N/A"}},{"$f":"MATCH(M$4,Millwall!$Z131:$AK131,0)","v":{"$error":"#N/A"}},{"$f":"MATCH(N$4,Millwall!$Z131:$AK131,0)","v":{"$error":"#N/A"}},{"$f":"MATCH(O$4,Millwall!$Z131:$AK131,0)","v":{"$error":"#N/A"}},{"$f":"MATCH(P$4,Millwall!$Z131:$AK131,0)","v":{"$error":"#N/A"}},{"$f":"MATCH(Q$4,Millwall!$Z131:$AK131,0)","v":{"$error":"#N/A"}},{"$f":"MATCH(R$4,Millwall!$Z131:$AK131,0)","v":{"$error":"#N/A"}},{"$f":"MATCH(S$4,Millwall!$Z131:$AK131,0)","v":{"$error":"#N/A"}},{"$f":"MATCH(T$4,Millwall!$Z131:$AK131,0)","v":{"$error":"#N/A"}},{"$f":"MATCH(U$4,Millwall!$Z131:$AK131,0)","v":{"$error":"#N/A"}},{"$f":"MATCH(V$4,Millwall!$Z131:$AK131,0)","v":{"$error":"#N/A"}},{"$f":"MATCH(W$4,Millwall!$Z131:$AK131,0)","v":{"$error":"#N/A"}},{"$f":"MATCH(X$4,Millwall!$Z131:$AK131,0)","v":{"$error":"#N/A"}},{"$f":"MATCH(Y$4,Millwall!$Z131:$AK131,0)","v":{"$error":"#N/A"}},{"$f":"MATCH(Z$4,Millwall!$Z131:$AK131,0)","v":{"$error":"#N/A"}},{"$f":"MATCH(AA$4,Millwall!$Z131:$AK131,0)","v":{"$error":"#N/A"}},{"$f":"MATCH(AB$4,Millwall!$Z131:$AK131,0)","v":{"$error":"#N/A"}},{"$f":"MATCH(AC$4,Millwall!$Z131:$AK131,0)","v":{"$error":"#N/A"}},{"$f":"MATCH(AD$4,Millwall!$Z131:$AK131,0)","v":{"$error":"#N/A"}},{"$f":"MATCH(AE$4,Millwall!$Z131:$AK131,0)","v":{"$error":"#N/A"}},{"$f":"MATCH(AF$4,Millwall!$Z131:$AK131,0)","v":{"$error":"#N/A"}},{"$f":"MATCH(AG$4,Millwall!$Z131:$AK131,0)","v":{"$error":"#N/A"}},{"$f":"MATCH(AH$3,Millwall!$Z131:$AK131,0)","v":{"$error":"#N/A"}},{"$f":"MATCH(AI$3,Millwall!$Z131:$AK131,0)","v":{"$error":"#N/A"}},{"$f":"MATCH(AJ$3,Millwall!$Z131:$AK131,0)","v":{"$error":"#N/A"}},{"$f":"MATCH(AK$3,Millwall!$Z131:$AK131,0)","v":{"$error":"#N/A"}},{"$f":"MATCH(AL$3,Millwall!$Z131:$AK131,0)","v":{"$error":"#N/A"}},{"$f":"MATCH(AM$3,Millwall!$Z131:$AK131,0)","v":{"$error":"#N/A"}},{"$f":"MATCH(AN$3,Millwall!$Z131:$AK131,0)","v":{"$error":"#N/A"}},{"$f":"MATCH(AO$3,Millwall!$Z131:$AK131,0)","v":{"$error":"#N/A"}},{"$f":"MATCH(AP$3,Millwall!$Z131:$AK131,0)","v":{"$error":"#N/A"}},{"$f":"MATCH(AQ$3,Millwall!$Z131:$AK131,0)","v":{"$error":"#N/A"}},{"$f":"MATCH(AR$3,Millwall!$Z131:$AK131,0)","v":{"$error":"#N/A"}},null,null,null,null,null,{"$f":"MATCH(AX$3,Millwall!$Z131:AK131,0)","v":{"$error":"#N/A"}},{"$f":"MATCH(AY$3,Millwall!$Z131:AK131,0)","v":{"$error":"#N/A"}},{"$f":"MATCH(AZ$3,Millwall!$Z131:AK131,0)","v":{"$error":"#N/A"}},{"$f":"MATCH(BA$3,Millwall!$Z131:AK131,0)","v":{"$error":"#N/A"}},{"$f":"MATCH(BB$3,Millwall!$Z131:AK131,0)","v":{"$error":"#N/A"}},{"$f":"MATCH(BC$3,Millwall!$Z131:AK131,0)","v":{"$error":"#N/A"}},{"$f":"MATCH(BD$3,Millwall!$Z131:AK131,0)","v":{"$error":"#N/A"}},{"$f":"MATCH(BE$3,Millwall!$Z131:AK131,0)","v":{"$error":"#N/A"}},{"$f":"MATCH(BF$3,Millwall!$Z131:AK131,0)","v":{"$error":"#N/A"}},{"$f":"MATCH(BG$3,Millwall!$Z131:AK131,0)","v":{"$error":"#N/A"}},{"$f":"MATCH(BH$3,Millwall!$Z131:AK131,0)","v":{"$error":"#N/A"}},{"$f":"MATCH(BI$3,Millwall!$Z131:AK131,0)","v":{"$error":"#N/A"}},{"$f":"MATCH(BJ$3,Millwall!$Z131:AK131,0)","v":{"$error":"#N/A"}},{"$f":"MATCH(BK$3,Millwall!$Z131:AK131,0)","v":{"$error":"#N/A"}},{"$f":"MATCH(BL$3,Millwall!$Z131:AK131,0)","v":{"$error":"#N/A"}},{"$f":"MATCH(BM$3,Millwall!$Z131:AK131,0)","v":{"$error":"#N/A"}},{"$f":"MATCH(BN$3,Millwall!$Z131:AK131,0)","v":{"$error":"#N/A"}},{"$f":"MATCH(BO$3,Millwall!$Z131:AK131,0)","v":{"$error":"#N/A"}},{"$f":"MATCH(BP$3,Millwall!$Z131:AK131,0)","v":{"$error":"#N/A"}},{"$f":"MATCH(BQ$3,Millwall!$Z131:AK131,0)","v":{"$error":"#N/A"}},{"$f":"MATCH(BR$3,Millwall!$Z131:AK131,0)","v":{"$error":"#N/A"}},{"$f":"MATCH(BS$3,Millwall!$Z131:AK131,0)","v":{"$error":"#N/A"}},{"$f":"MATCH(BT$3,Millwall!$Z131:AK131,0)","v":{"$error":"#N/A"}},{"$f":"MATCH(BU$3,Millwall!$Z131:AK131,0)","v":{"$error":"#N/A"}},{"$f":"MATCH(BV$3,Millwall!$Z131:AK131,0)","v":{"$error":"#N/A"}},{"$f":"MATCH(BW$3,Millwall!$Z131:AK131,0)","v":{"$error":"#N/A"}},{"$f":"MATCH(BX$3,Millwall!$Z131:AK131,0)","v":{"$error":"#N/A"}},{"$f":"MATCH(BY$3,Millwall!$Z131:AK131,0)","v":{"$error":"#N/A"}},{"$f":"MATCH(BZ$3,Millwall!$Z131:AK131,0)","v":{"$error":"#N/A"}},{"$f":"MATCH(CA$3,Millwall!$Z131:AK131,0)","v":{"$error":"#N/A"}},{"$f":"MATCH(CB$3,Millwall!$Z131:AK131,0)","v":{"$error":"#N/A"}},{"$f":"MATCH(CC$3,Millwall!$Z131:AK131,0)","v":{"$error":"#N/A"}},{"$f":"MATCH(CD$3,Millwall!$Z131:AK131,0)","v":{"$error":"#N/A"}},{"$f":"MATCH(CE$3,Millwall!$Z131:AK131,0)","v":{"$error":"#N/A"}}]
[null,null,1,null,null,{"$f":"Millwall!V132","v":"00:00:00"},null,{"$f":"Millwall!W132","v":"00:00:00"},{"$f":"Millwall!X132","v":"00:00:00"},{"$f":"Millwall!Y132","v":0},{"$f":"MATCH(K$4,Millwall!$Z132:$AK132,0)","v":{"$error":"#N/A"}},{"$f":"MATCH(L$4,Millwall!$Z132:$AK132,0)","v":{"$error":"#N/A"}},{"$f":"MATCH(M$4,Millwall!$Z132:$AK132,0)","v":{"$error":"#N/A"}},{"$f":"MATCH(N$4,Millwall!$Z132:$AK132,0)","v":{"$error":"#N/A"}},{"$f":"MATCH(O$4,Millwall!$Z132:$AK132,0)","v":{"$error":"#N/A"}},{"$f":"MATCH(P$4,Millwall!$Z132:$AK132,0)","v":{"$error":"#N/A"}},{"$f":"MATCH(Q$4,Millwall!$Z132:$AK132,0)","v":{"$error":"#N/A"}},{"$f":"MATCH(R$4,Millwall!$Z132:$AK132,0)","v":{"$error":"#N/A"}},{"$f":"MATCH(S$4,Millwall!$Z132:$AK132,0)","v":{"$error":"#N/A"}},{"$f":"MATCH(T$4,Millwall!$Z132:$AK132,0)","v":{"$error":"#N/A"}},{"$f":"MATCH(U$4,Millwall!$Z132:$AK132,0)","v":{"$error":"#N/A"}},{"$f":"MATCH(V$4,Millwall!$Z132:$AK132,0)","v":{"$error":"#N/A"}},{"$f":"MATCH(W$4,Millwall!$Z132:$AK132,0)","v":{"$error":"#N/A"}},{"$f":"MATCH(X$4,Millwall!$Z132:$AK132,0)","v":{"$error":"#N/A"}},{"$f":"MATCH(Y$4,Millwall!$Z132:$AK132,0)","v":{"$error":"#N/A"}},{"$f":"MATCH(Z$4,Millwall!$Z132:$AK132,0)","v":{"$error":"#N/A"}},{"$f":"MATCH(AA$4,Millwall!$Z132:$AK132,0)","v":{"$error":"#N/A"}},{"$f":"MATCH(AB$4,Millwall!$Z132:$AK132,0)","v":{"$error":"#N/A"}},{"$f":"MATCH(AC$4,Millwall!$Z132:$AK132,0)","v":{"$error":"#N/A"}},{"$f":"MATCH(AD$4,Millwall!$Z132:$AK132,0)","v":{"$error":"#N/A"}},{"$f":"MATCH(AE$4,Millwall!$Z132:$AK132,0)","v":{"$error":"#N/A"}},{"$f":"MATCH(AF$4,Millwall!$Z132:$AK132,0)","v":{"$error":"#N/A"}},{"$f":"MATCH(AG$4,Millwall!$Z132:$AK132,0)","v":{"$error":"#N/A"}},{"$f":"MATCH(AH$3,Millwall!$Z132:$AK132,0)","v":{"$error":"#N/A"}},{"$f":"MATCH(AI$3,Millwall!$Z132:$AK132,0)","v":{"$error":"#N/A"}},{"$f":"MATCH(AJ$3,Millwall!$Z132:$AK132,0)","v":{"$error":"#N/A"}},{"$f":"MATCH(AK$3,Millwall!$Z132:$AK132,0)","v":{"$error":"#N/A"}},{"$f":"MATCH(AL$3,Millwall!$Z132:$AK132,0)","v":{"$error":"#N/A"}},{"$f":"MATCH(AM$3,Millwall!$Z132:$AK132,0)","v":{"$error":"#N/A"}},{"$f":"MATCH(AN$3,Millwall!$Z132:$AK132,0)","v":{"$error":"#N/A"}},{"$f":"MATCH(AO$3,Millwall!$Z132:$AK132,0)","v":{"$error":"#N/A"}},{"$f":"MATCH(AP$3,Millwall!$Z132:$AK132,0)","v":{"$error":"#N/A"}},{"$f":"MATCH(AQ$3,Millwall!$Z132:$AK132,0)","v":{"$error":"#N/A"}},{"$f":"MATCH(AR$3,Millwall!$Z132:$AK132,0)","v":{"$error":"#N/A"}},null,null,null,null,null,{"$f":"MATCH(AX$3,Millwall!$Z132:AK132,0)","v":{"$error":"#N/A"}},{"$f":"MATCH(AY$3,Millwall!$Z132:AK132,0)","v":{"$error":"#N/A"}},{"$f":"MATCH(AZ$3,Millwall!$Z132:AK132,0)","v":{"$error":"#N/A"}},{"$f":"MATCH(BA$3,Millwall!$Z132:AK132,0)","v":{"$error":"#N/A"}},{"$f":"MATCH(BB$3,Millwall!$Z132:AK132,0)","v":{"$error":"#N/A"}},{"$f":"MATCH(BC$3,Millwall!$Z132:AK132,0)","v":{"$error":"#N/A"}},{"$f":"MATCH(BD$3,Millwall!$Z132:AK132,0)","v":{"$error":"#N/A"}},{"$f":"MATCH(BE$3,Millwall!$Z132:AK132,0)","v":{"$error":"#N/A"}},{"$f":"MATCH(BF$3,Millwall!$Z132:AK132,0)","v":{"$error":"#N/A"}},{"$f":"MATCH(BG$3,Millwall!$Z132:AK132,0)","v":{"$error":"#N/A"}},{"$f":"MATCH(BH$3,Millwall!$Z132:AK132,0)","v":{"$error":"#N/A"}},{"$f":"MATCH(BI$3,Millwall!$Z132:AK132,0)","v":{"$error":"#N/A"}},{"$f":"MATCH(BJ$3,Millwall!$Z132:AK132,0)","v":{"$error":"#N/A"}},{"$f":"MATCH(BK$3,Millwall!$Z132:AK132,0)","v":{"$error":"#N/A"}},{"$f":"MATCH(BL$3,Millwall!$Z132:AK132,0)","v":{"$error":"#N/A"}},{"$f":"MATCH(BM$3,Millwall!$Z132:AK132,0)","v":{"$error":"#N/A"}},{"$f":"MATCH(BN$3,Millwall!$Z132:AK132,0)","v":{"$error":"#N/A"}},{"$f":"MATCH(BO$3,Millwall!$Z132:AK132,0)","v":{"$error":"#N/A"}},{"$f":"MATCH(BP$3,Millwall!$Z132:AK132,0)","v":{"$error":"#N/A"}},{"$f":"MATCH(BQ$3,Millwall!$Z132:AK132,0)","v":{"$error":"#N/A"}},{"$f":"MATCH(BR$3,Millwall!$Z132:AK132,0)","v":{"$error":"#N/A"}},{"$f":"MATCH(BS$3,Millwall!$Z132:AK132,0)","v":{"$error":"#N/A"}},{"$f":"MATCH(BT$3,Millwall!$Z132:AK132,0)","v":{"$error":"#N/A"}},{"$f":"MATCH(BU$3,Millwall!$Z132:AK132,0)","v":{"$error":"#N/A"}},{"$f":"MATCH(BV$3,Millwall!$Z132:AK132,0)","v":{"$error":"#N/A"}},{"$f":"MATCH(BW$3,Millwall!$Z132:AK132,0)","v":{"$error":"#N/A"}},{"$f":"MATCH(BX$3,Millwall!$Z132:AK132,0)","v":{"$error":"#N/A"}},{"$f":"MATCH(BY$3,Millwall!$Z132:AK132,0)","v":{"$error":"#N/A"}},{"$f":"MATCH(BZ$3,Millwall!$Z132:AK132,0)","v":{"$error":"#N/A"}},{"$f":"MATCH(CA$3,Millwall!$Z132:AK132,0)","v":{"$error":"#N/A"}},{"$f":"MATCH(CB$3,Millwall!$Z132:AK132,0)","v":{"$error":"#N/A"}},{"$f":"MATCH(CC$3,Millwall!$Z132:AK132,0)","v":{"$error":"#N/A"}},{"$f":"MATCH(CD$3,Millwall!$Z132:AK132,0)","v":{"$error":"#N/A"}},{"$f":"MATCH(CE$3,Millwall!$Z132:AK132,0)","v":{"$error":"#N/A"}}]
[]
[null,null,null,null,null,null,null,null,null,"Total FA Cup Apperances",{"$f":"COUNT(K57:K63)-K66","v":2},{"$f":"COUNT(L57:L63)-L66","v":0},2,0,0,0,3,0,0,2,3,0,3,2,1,0,0,3,3,3,3,0,0,3,0,0,0,0,0,0,0,0,0,0]
[null,null,null,null,null,null,null,null,null,"Total FA Cup Substitute Appearences ",{"$f":"COUNTIF(K57:K63,\">=12\")","v":1},{"$f":"COUNTIF(L57:L63,\">=12\")","v":0},1,0,0,0,0,0,0,0,0,0,0,1,0,0,0,0,0,0,0,0,0,0,0,0,0,0,0,0,0,0,0,0]
[null,null,null,null,null,null,null,null,null,"Goals",{"$f":"Millwall!$BZ$6","v":0},{"$f":"Millwall!$BZ$7","v":0},{"$f":"Millwall!$BZ$8","v":1},{"$f":"Millwall!$BZ$9","v":0},{"$f":"Millwall!$BZ$10","v":0},{"$f":"Millwall!$BZ$11","v":0},{"$f":"Millwall!$BZ$12","v":0},{"$f":"Millwall!$BZ$13","v":0},{"$f":"Millwall!$BZ$14","v":0},{"$f":"Millwall!$BZ$15","v":0},{"$f":"Millwall!$BZ$16","v":0},{"$f":"Millwall!$BZ$17","v":0},{"$f":"Millwall!$BZ$18","v":0},{"$f":"Millwall!$BZ$19","v":1},{"$f":"Millwall!$BZ$20","v":0},{"$f":"Millwall!$BZ$21","v":0},{"$f":"Millwall!$BZ$22","v":0},{"$f":"Millwall!$BZ$23","v":0},{"$f":"Millwall!$BZ$24","v":0},{"$f":"Millwall!$BZ$25","v":0},{"$f":"Millwall!$BZ$26","v":0},{"$f":"Millwall!$BZ$27","v":0},{"$f":"Millwall!$BZ$28","v":0},{"$f":"Millwall!$BZ$29","v":1},{"$f":"Millwall!$BZ$30","v":0},{"$f":"Millwall!$BZ$33","v":0},{"$f":"Millwall!$BZ$34","v":3},{"$f":"Millwall!$BZ$35","v":0},{"$f":"Millwall!$BZ$36","v":0},{"$f":"Millwall!$BZ$37","v":0},{"$f":"Millwall!$BZ$38","v":0},{"$f":"Millwall!$BZ$39","v":0},{"$f":"Millwall!$BZ$40","v":0},{"$f":"Millwall!$BZ$41","v":0}]
[null,null,1]
[null,null,null,null,null,null,null,"League Cup"]
[null,null,{"$f":"IF(J70=0,1,0)","v":0},2,null,{"$f":"Millwall!V136","v":"1974-09-02"},null,{"$f":"Millwall!W136","v":"West Brom"},{"$f":"Millwall!X136","v":"(A)"},{"$f":"Millwall!Y136","v":"L 0-1"},{"$f":"MATCH(K$4,Millwall!$Z136:$AK136,0)","v":{"$error":"#N/A"}},{"$f":"MATCH(L$4,Millwall!$Z136:$AK136,0)","v":{"$error":"#N/A"}},{"$f":"MATCH(M$4,Millwall!$Z136:$AK136,0)","v":10},{"$f":"MATCH(N$4,Millwall!$Z136:$AK136,0)","v":{"$error":"#N/A"}},{"$f":"MATCH(O$4,Millwall!$Z136:$AK136,0)","v":{"$error":"#N/A"}},{"$f":"MATCH(P$4,Millwall!$Z136:$AK136,0)","v":{"$error":"#N/A"}},{"$f":"MATCH(Q$4,Millwall!$Z136:$AK136,0)","v":9},{"$f":"MATCH(R$4,Millwall!$Z136:$AK136,0)","v":{"$error":"#N/A"}},{"$f":"MATCH(S$4,Millwall!$Z136:$AK136,0)","v":{"$error":"#N/A"}},{"$f":"MATCH(T$4,Millwall!$Z136:$AK136,0)","v":2},{"$f":"MATCH(U$4,Millwall!$Z136:$AK136,0)","v":4},{"$f":"MATCH(V$4,Millwall!$Z136:$AK136,0)","v":{"$error":"#N/A"}},{"$f":"MATCH(W$4,Millwall!$Z136:$AK136,0)","v":{"$error":"#N/A"}},{"$f":"MATCH(X$4,Millwall!$Z136:$AK136,0)","v":11},{"$f":"MATCH(Y$4,Millwall!$Z136:$AK136,0)","v":3},{"$f":"MATCH(Z$4,Millwall!$Z136:$AK136,0)","v":{"$error":"#N/A"}},{"$f":"MATCH(AA$4,Millwall!$Z136:$AK136,0)","v":8},{"$f":"MATCH(AB$4,Millwall!$Z136:$AK136,0)","v":1},{"$f":"MATCH(AC$4,Millwall!$Z136:$AK136,0)","v":5},{"$f":"MATCH(AD$4,Millwall!$Z136:$AK136,0)","v":{"$error":"#N/A"}},{"$f":"MATCH(AE$4,Millwall!$Z136:$AK136,0)","v":6},{"$f":"MATCH(AF$4,Millwall!$Z136:$AK136,0)","v":7},{"$f":"MATCH(AG$4,Millwall!$Z136:$AK136,0)","v":{"$error":"#N/A"}},{"$f":"MATCH(AH$3,Millwall!$Z136:$AK136,0)","v":{"$error":"#N/A"}},{"$f":"MATCH(AI$3,Millwall!$Z136:$AK136,0)","v":{"$error":"#N/A"}},{"$f":"MATCH(AJ$3,Millwall!$Z136:$AK136,0)","v":{"$error":"#N/A"}},{"$f":"MATCH(AK$3,Millwall!$Z136:$AK136,0)","v":{"$error":"#N/A"}},{"$f":"MATCH(AL$3,Millwall!$Z136:$AK136,0)","v":{"$error":"#N/A"}},{"$f":"MATCH(AM$3,Millwall!$Z136:$AK136,0)","v":{"$error":"#N/A"}},{"$f":"MATCH(AN$3,Millwall!$Z136:$AK136,0)","v":{"$error":"#N/A"}},{"$f":"MATCH(AO$3,Millwall!$Z136:$AK136,0)","v":{"$error":"#N/A"}},{"$f":"MATCH(AP$3,Millwall!$Z136:$AK136,0)","v":{"$error":"#N/A"}},{"$f":"MATCH(AQ$3,Millwall!$Z136:$AK136,0)","v":{"$error":"#N/A"}},{"$f":"MATCH(AR$3,Millwall!$Z136:$AK136,0)","v":{"$error":"#N/A"}},null,null,null,null,null,{"$f":"MATCH(AX$3,Millwall!$Z136:AK136,0)","v":{"$error":"#N/A"}},{"$f":"MATCH(AY$3,Millwall!$Z136:AK136,0)","v":{"$error":"#N/A"}},{"$f":"MATCH(AZ$3,Millwall!$Z136:AK136,0)","v":{"$error":"#N/A"}},{"$f":"MATCH(BA$3,Millwall!$Z136:AK136,0)","v":{"$error":"#N/A"}},{"$f":"MATCH(BB$3,Millwall!$Z136:AK136,0)","v":{"$error":"#N/A"}},{"$f":"MATCH(BC$3,Millwall!$Z136:AK136,0)","v":{"$error":"#N/A"}},{"$f":"MATCH(BD$3,Millwall!$Z136:AK136,0)","v":{"$error":"#N/A"}},{"$f":"MATCH(BE$3,Millwall!$Z136:AK136,0)","v":{"$error":"#N/A"}},{"$f":"MATCH(BF$3,Millwall!$Z136:AK136,0)","v":{"$error":"#N/A"}},{"$f":"MATCH(BG$3,Millwall!$Z136:AK136,0)","v":{"$error":"#N/A"}},{"$f":"MATCH(BH$3,Millwall!$Z136:AK136,0)","v":{"$error":"#N/A"}},{"$f":"MATCH(BI$3,Millwall!$Z136:AK136,0)","v":{"$error":"#N/A"}},{"$f":"MATCH(BJ$3,Millwall!$Z136:AK136,0)","v":{"$error":"#N/A"}},{"$f":"MATCH(BK$3,Millwall!$Z136:AK136,0)","v":{"$error":"#N/A"}},{"$f":"MATCH(BL$3,Millwall!$Z136:AK136,0)","v":{"$error":"#N/A"}},{"$f":"MATCH(BM$3,Millwall!$Z136:AK136,0)","v":{"$error":"#N/A"}},{"$f":"MATCH(BN$3,Millwall!$Z136:AK136,0)","v":{"$error":"#N/A"}},{"$f":"MATCH(BO$3,Millwall!$Z136:AK136,0)","v":{"$error":"#N/A"}},{"$f":"MATCH(BP$3,Millwall!$Z136:AK136,0)","v":{"$error":"#N/A"}},{"$f":"MATCH(BQ$3,Millwall!$Z136:AK136,0)","v":{"$error":"#N/A"}},{"$f":"MATCH(BR$3,Millwall!$Z136:AK136,0)","v":{"$error":"#N/A"}},{"$f":"MATCH(BS$3,Millwall!$Z136:AK136,0)","v":{"$error":"#N/A"}},{"$f":"MATCH(BT$3,Millwall!$Z136:AK136,0)","v":{"$error":"#N/A"}},{"$f":"MATCH(BU$3,Millwall!$Z136:AK136,0)","v":{"$error":"#N/A"}},{"$f":"MATCH(BV$3,Millwall!$Z136:AK136,0)","v":{"$error":"#N/A"}},{"$f":"MATCH(BW$3,Millwall!$Z136:AK136,0)","v":{"$error":"#N/A"}},{"$f":"MATCH(BX$3,Millwall!$Z136:AK136,0)","v":{"$error":"#N/A"}},{"$f":"MATCH(BY$3,Millwall!$Z136:AK136,0)","v":{"$error":"#N/A"}},{"$f":"MATCH(BZ$3,Millwall!$Z136:AK136,0)","v":{"$error":"#N/A"}},{"$f":"MATCH(CA$3,Millwall!$Z136:AK136,0)","v":{"$error":"#N/A"}},{"$f":"MATCH(CB$3,Millwall!$Z136:AK136,0)","v":{"$error":"#N/A"}},{"$f":"MATCH(CC$3,Millwall!$Z136:AK136,0)","v":{"$error":"#N/A"}},{"$f":"MATCH(CD$3,Millwall!$Z136:AK136,0)","v":{"$error":"#N/A"}},{"$f":"MATCH(CE$3,Millwall!$Z136:AK136,0)","v":{"$error":"#N/A"}}]
[null,null,{"$f":"IF(J71=0,1,0)","v":1},null,null,{"$f":"Millwall!V137","v":"00:00:00"},null,{"$f":"Millwall!W137","v":"00:00:00"},{"$f":"Millwall!X137","v":"00:00:00"},{"$f":"Millwall!Y137","v":0},{"$f":"MATCH(K$4,Millwall!$Z137:$AK137,0)","v":{"$error":"#N/A"}},{"$f":"MATCH(L$4,Millwall!$Z137:$AK137,0)","v":{"$error":"#N/A"}},{"$f":"MATCH(M$4,Millwall!$Z137:$AK137,0)","v":{"$error":"#N/A"}},{"$f":"MATCH(N$4,Millwall!$Z137:$AK137,0)","v":{"$error":"#N/A"}},{"$f":"MATCH(O$4,Millwall!$Z137:$AK137,0)","v":{"$error":"#N/A"}},{"$f":"MATCH(P$4,Millwall!$Z137:$AK137,0)","v":{"$error":"#N/A"}},{"$f":"MATCH(Q$4,Millwall!$Z137:$AK137,0)","v":{"$error":"#N/A"}},{"$f":"MATCH(R$4,Millwall!$Z137:$AK137,0)","v":{"$error":"#N/A"}},{"$f":"MATCH(S$4,Millwall!$Z137:$AK137,0)","v":{"$error":"#N/A"}},{"$f":"MATCH(T$4,Millwall!$Z137:$AK137,0)","v":{"$error":"#N/A"}},{"$f":"MATCH(U$4,Millwall!$Z137:$AK137,0)","v":{"$error":"#N/A"}},{"$f":"MATCH(V$4,Millwall!$Z137:$AK137,0)","v":{"$error":"#N/A"}},{"$f":"MATCH(W$4,Millwall!$Z137:$AK137,0)","v":{"$error":"#N/A"}},{"$f":"MATCH(X$4,Millwall!$Z137:$AK137,0)","v":{"$error":"#N/A"}},{"$f":"MATCH(Y$4,Millwall!$Z137:$AK137,0)","v":{"$error":"#N/A"}},{"$f":"MATCH(Z$4,Millwall!$Z137:$AK137,0)","v":{"$error":"#N/A"}},{"$f":"MATCH(AA$4,Millwall!$Z137:$AK137,0)","v":{"$error":"#N/A"}},{"$f":"MATCH(AB$4,Millwall!$Z137:$AK137,0)","v":{"$error":"#N/A"}},{"$f":"MATCH(AC$4,Millwall!$Z137:$AK137,0)","v":{"$error":"#N/A"}},{"$f":"MATCH(AD$4,Millwall!$Z137:$AK137,0)","v":{"$error":"#N/A"}},{"$f":"MATCH(AE$4,Millwall!$Z137:$AK137,0)","v":{"$error":"#N/A"}},{"$f":"MATCH(AF$4,Millwall!$Z137:$AK137,0)","v":{"$error":"#N/A"}},{"$f":"MATCH(AG$4,Millwall!$Z137:$AK137,0)","v":{"$error":"#N/A"}},{"$f":"MATCH(AH$3,Millwall!$Z137:$AK137,0)","v":{"$error":"#N/A"}},{"$f":"MATCH(AI$3,Millwall!$Z137:$AK137,0)","v":{"$error":"#N/A"}},{"$f":"MATCH(AJ$3,Millwall!$Z137:$AK137,0)","v":{"$error":"#N/A"}},{"$f":"MATCH(AK$3,Millwall!$Z137:$AK137,0)","v":{"$error":"#N/A"}},{"$f":"MATCH(AL$3,Millwall!$Z137:$AK137,0)","v":{"$error":"#N/A"}},{"$f":"MATCH(AM$3,Millwall!$Z137:$AK137,0)","v":{"$error":"#N/A"}},{"$f":"MATCH(AN$3,Millwall!$Z137:$AK137,0)","v":{"$error":"#N/A"}},{"$f":"MATCH(AO$3,Millwall!$Z137:$AK137,0)","v":{"$error":"#N/A"}},{"$f":"MATCH(AP$3,Millwall!$Z137:$AK137,0)","v":{"$error":"#N/A"}},{"$f":"MATCH(AQ$3,Millwall!$Z137:$AK137,0)","v":{"$error":"#N/A"}},{"$f":"MATCH(AR$3,Millwall!$Z137:$AK137,0)","v":{"$error":"#N/A"}},null,null,null,null,null,{"$f":"MATCH(AX$3,Millwall!$Z137:AK137,0)","v":{"$error":"#N/A"}},{"$f":"MATCH(AY$3,Millwall!$Z137:AK137,0)","v":{"$error":"#N/A"}},{"$f":"MATCH(AZ$3,Millwall!$Z137:AK137,0)","v":{"$error":"#N/A"}},{"$f":"MATCH(BA$3,Millwall!$Z137:AK137,0)","v":{"$error":"#N/A"}},{"$f":"MATCH(BB$3,Millwall!$Z137:AK137,0)","v":{"$error":"#N/A"}},{"$f":"MATCH(BC$3,Millwall!$Z137:AK137,0)","v":{"$error":"#N/A"}},{"$f":"MATCH(BD$3,Millwall!$Z137:AK137,0)","v":{"$error":"#N/A"}},{"$f":"MATCH(BE$3,Millwall!$Z137:AK137,0)","v":{"$error":"#N/A"}},{"$f":"MATCH(BF$3,Millwall!$Z137:AK137,0)","v":{"$error":"#N/A"}},{"$f":"MATCH(BG$3,Millwall!$Z137:AK137,0)","v":{"$error":"#N/A"}},{"$f":"MATCH(BH$3,Millwall!$Z137:AK137,0)","v":{"$error":"#N/A"}},{"$f":"MATCH(BI$3,Millwall!$Z137:AK137,0)","v":{"$error":"#N/A"}},{"$f":"MATCH(BJ$3,Millwall!$Z137:AK137,0)","v":{"$error":"#N/A"}},{"$f":"MATCH(BK$3,Millwall!$Z137:AK137,0)","v":{"$error":"#N/A"}},{"$f":"MATCH(BL$3,Millwall!$Z137:AK137,0)","v":{"$error":"#N/A"}},{"$f":"MATCH(BM$3,Millwall!$Z137:AK137,0)","v":{"$error":"#N/A"}},{"$f":"MATCH(BN$3,Millwall!$Z137:AK137,0)","v":{"$error":"#N/A"}},{"$f":"MATCH(BO$3,Millwall!$Z137:AK137,0)","v":{"$error":"#N/A"}},{"$f":"MATCH(BP$3,Millwall!$Z137:AK137,0)","v":{"$error":"#N/A"}},{"$f":"MATCH(BQ$3,Millwall!$Z137:AK137,0)","v":{"$error":"#N/A"}},{"$f":"MATCH(BR$3,Millwall!$Z137:AK137,0)","v":{"$error":"#N/A"}},{"$f":"MATCH(BS$3,Millwall!$Z137:AK137,0)","v":{"$error":"#N/A"}},{"$f":"MATCH(BT$3,Millwall!$Z137:AK137,0)","v":{"$error":"#N/A"}},{"$f":"MATCH(BU$3,Millwall!$Z137:AK137,0)","v":{"$error":"#N/A"}},{"$f":"MATCH(BV$3,Millwall!$Z137:AK137,0)","v":{"$error":"#N/A"}},{"$f":"MATCH(BW$3,Millwall!$Z137:AK137,0)","v":{"$error":"#N/A"}},{"$f":"MATCH(BX$3,Millwall!$Z137:AK137,0)","v":{"$error":"#N/A"}},{"$f":"MATCH(BY$3,Millwall!$Z137:AK137,0)","v":{"$error":"#N/A"}},{"$f":"MATCH(BZ$3,Millwall!$Z137:AK137,0)","v":{"$error":"#N/A"}},{"$f":"MATCH(CA$3,Millwall!$Z137:AK137,0)","v":{"$error":"#N/A"}},{"$f":"MATCH(CB$3,Millwall!$Z137:AK137,0)","v":{"$error":"#N/A"}},{"$f":"MATCH(CC$3,Millwall!$Z137:AK137,0)","v":{"$error":"#N/A"}},{"$f":"MATCH(CD$3,Millwall!$Z137:AK137,0)","v":{"$error":"#N/A"}},{"$f":"MATCH(CE$3,Millwall!$Z137:AK137,0)","v":{"$error":"#N/A"}}]
[null,null,1,null,null,{"$f":"Millwall!V138","v":"00:00:00"},null,{"$f":"Millwall!W138","v":"00:00:00"},{"$f":"Millwall!X138","v":"00:00:00"},{"$f":"Millwall!Y138","v":0},{"$f":"MATCH(K$4,Millwall!$Z138:$AK138,0)","v":{"$error":"#N/A"}},{"$f":"MATCH(L$4,Millwall!$Z138:$AK138,0)","v":{"$error":"#N/A"}},{"$f":"MATCH(M$4,Millwall!$Z138:$AK138,0)","v":{"$error":"#N/A"}},{"$f":"MATCH(N$4,Millwall!$Z138:$AK138,0)","v":{"$error":"#N/A"}},{"$f":"MATCH(O$4,Millwall!$Z138:$AK138,0)","v":{"$error":"#N/A"}},{"$f":"MATCH(P$4,Millwall!$Z138:$AK138,0)","v":{"$error":"#N/A"}},{"$f":"MATCH(Q$4,Millwall!$Z138:$AK138,0)","v":{"$error":"#N/A"}},{"$f":"MATCH(R$4,Millwall!$Z138:$AK138,0)","v":{"$error":"#N/A"}},{"$f":"MATCH(S$4,Millwall!$Z138:$AK138,0)","v":{"$error":"#N/A"}},{"$f":"MATCH(T$4,Millwall!$Z138:$AK138,0)","v":{"$error":"#N/A"}},{"$f":"MATCH(U$4,Millwall!$Z138:$AK138,0)","v":{"$error":"#N/A"}},{"$f":"MATCH(V$4,Millwall!$Z138:$AK138,0)","v":{"$error":"#N/A"}},{"$f":"MATCH(W$4,Millwall!$Z138:$AK138,0)","v":{"$error":"#N/A"}},{"$f":"MATCH(X$4,Millwall!$Z138:$AK138,0)","v":{"$error":"#N/A"}},{"$f":"MATCH(Y$4,Millwall!$Z138:$AK138,0)","v":{"$error":"#N/A"}},{"$f":"MATCH(Z$4,Millwall!$Z138:$AK138,0)","v":{"$error":"#N/A"}},{"$f":"MATCH(AA$4,Millwall!$Z138:$AK138,0)","v":{"$error":"#N/A"}},{"$f":"MATCH(AB$4,Millwall!$Z138:$AK138,0)","v":{"$error":"#N/A"}},{"$f":"MATCH(AC$4,Millwall!$Z138:$AK138,0)","v":{"$error":"#N/A"}},{"$f":"MATCH(AD$4,Millwall!$Z138:$AK138,0)","v":{"$error":"#N/A"}},{"$f":"MATCH(AE$4,Millwall!$Z138:$AK138,0)","v":{"$error":"#N/A"}},{"$f":"MATCH(AF$4,Millwall!$Z138:$AK138,0)","v":{"$error":"#N/A"}},{"$f":"MATCH(AG$4,Millwall!$Z138:$AK138,0)","v":{"$error":"#N/A"}},{"$f":"MATCH(AH$3,Millwall!$Z138:$AK138,0)","v":{"$error":"#N/A"}},{"$f":"MATCH(AI$3,Millwall!$Z138:$AK138,0)","v":{"$error":"#N/A"}},{"$f":"MATCH(AJ$3,Millwall!$Z138:$AK138,0)","v":{"$error":"#N/A"}},{"$f":"MATCH(AK$3,Millwall!$Z138:$AK138,0)","v":{"$error":"#N/A"}},{"$f":"MATCH(AL$3,Millwall!$Z138:$AK138,0)","v":{"$error":"#N/A"}},{"$f":"MATCH(AM$3,Millwall!$Z138:$AK138,0)","v":{"$error":"#N/A"}},{"$f":"MATCH(AN$3,Millwall!$Z138:$AK138,0)","v":{"$error":"#N/A"}},{"$f":"MATCH(AO$3,Millwall!$Z138:$AK138,0)","v":{"$error":"#N/A"}},{"$f":"MATCH(AP$3,Millwall!$Z138:$AK138,0)","v":{"$error":"#N/A"}},{"$f":"MATCH(AQ$3,Millwall!$Z138:$AK138,0)","v":{"$error":"#N/A"}},{"$f":"MATCH(AR$3,Millwall!$Z138:$AK138,0)","v":{"$error":"#N/A"}},null,null,null,null,null,{"$f":"MATCH(AX$3,Millwall!$Z138:AK138,0)","v":{"$error":"#N/A"}},{"$f":"MATCH(AY$3,Millwall!$Z138:AK138,0)","v":{"$error":"#N/A"}},{"$f":"MATCH(AZ$3,Millwall!$Z138:AK138,0)","v":{"$error":"#N/A"}},{"$f":"MATCH(BA$3,Millwall!$Z138:AK138,0)","v":{"$error":"#N/A"}},{"$f":"MATCH(BB$3,Millwall!$Z138:AK138,0)","v":{"$error":"#N/A"}},{"$f":"MATCH(BC$3,Millwall!$Z138:AK138,0)","v":{"$error":"#N/A"}},{"$f":"MATCH(BD$3,Millwall!$Z138:AK138,0)","v":{"$error":"#N/A"}},{"$f":"MATCH(BE$3,Millwall!$Z138:AK138,0)","v":{"$error":"#N/A"}},{"$f":"MATCH(BF$3,Millwall!$Z138:AK138,0)","v":{"$error":"#N/A"}},{"$f":"MATCH(BG$3,Millwall!$Z138:AK138,0)","v":{"$error":"#N/A"}},{"$f":"MATCH(BH$3,Millwall!$Z138:AK138,0)","v":{"$error":"#N/A"}},{"$f":"MATCH(BI$3,Millwall!$Z138:AK138,0)","v":{"$error":"#N/A"}},{"$f":"MATCH(BJ$3,Millwall!$Z138:AK138,0)","v":{"$error":"#N/A"}},{"$f":"MATCH(BK$3,Millwall!$Z138:AK138,0)","v":{"$error":"#N/A"}},{"$f":"MATCH(BL$3,Millwall!$Z138:AK138,0)","v":{"$error":"#N/A"}},{"$f":"MATCH(BM$3,Millwall!$Z138:AK138,0)","v":{"$error":"#N/A"}},{"$f":"MATCH(BN$3,Millwall!$Z138:AK138,0)","v":{"$error":"#N/A"}},{"$f":"MATCH(BO$3,Millwall!$Z138:AK138,0)","v":{"$error":"#N/A"}},{"$f":"MATCH(BP$3,Millwall!$Z138:AK138,0)","v":{"$error":"#N/A"}},{"$f":"MATCH(BQ$3,Millwall!$Z138:AK138,0)","v":{"$error":"#N/A"}},{"$f":"MATCH(BR$3,Millwall!$Z138:AK138,0)","v":{"$error":"#N/A"}},{"$f":"MATCH(BS$3,Millwall!$Z138:AK138,0)","v":{"$error":"#N/A"}},{"$f":"MATCH(BT$3,Millwall!$Z138:AK138,0)","v":{"$error":"#N/A"}},{"$f":"MATCH(BU$3,Millwall!$Z138:AK138,0)","v":{"$error":"#N/A"}},{"$f":"MATCH(BV$3,Millwall!$Z138:AK138,0)","v":{"$error":"#N/A"}},{"$f":"MATCH(BW$3,Millwall!$Z138:AK138,0)","v":{"$error":"#N/A"}},{"$f":"MATCH(BX$3,Millwall!$Z138:AK138,0)","v":{"$error":"#N/A"}},{"$f":"MATCH(BY$3,Millwall!$Z138:AK138,0)","v":{"$error":"#N/A"}},{"$f":"MATCH(BZ$3,Millwall!$Z138:AK138,0)","v":{"$error":"#N/A"}},{"$f":"MATCH(CA$3,Millwall!$Z138:AK138,0)","v":{"$error":"#N/A"}},{"$f":"MATCH(CB$3,Millwall!$Z138:AK138,0)","v":{"$error":"#N/A"}},{"$f":"MATCH(CC$3,Millwall!$Z138:AK138,0)","v":{"$error":"#N/A"}},{"$f":"MATCH(CD$3,Millwall!$Z138:AK138,0)","v":{"$error":"#N/A"}},{"$f":"MATCH(CE$3,Millwall!$Z138:AK138,0)","v":{"$error":"#N/A"}}]
[null,null,1,null,null,{"$f":"Millwall!V139","v":"00:00:00"},null,{"$f":"Millwall!W139","v":"00:00:00"},{"$f":"Millwall!X139","v":"00:00:00"},{"$f":"Millwall!Y139","v":0},{"$f":"MATCH(K$4,Millwall!$Z139:$AK139,0)","v":{"$error":"#N/A"}},{"$f":"MATCH(L$4,Millwall!$Z139:$AK139,0)","v":{"$error":"#N/A"}},{"$f":"MATCH(M$4,Millwall!$Z139:$AK139,0)","v":{"$error":"#N/A"}},{"$f":"MATCH(N$4,Millwall!$Z139:$AK139,0)","v":{"$error":"#N/A"}},{"$f":"MATCH(O$4,Millwall!$Z139:$AK139,0)","v":{"$error":"#N/A"}},{"$f":"MATCH(P$4,Millwall!$Z139:$AK139,0)","v":{"$error":"#N/A"}},{"$f":"MATCH(Q$4,Millwall!$Z139:$AK139,0)","v":{"$error":"#N/A"}},{"$f":"MATCH(R$4,Millwall!$Z139:$AK139,0)","v":{"$error":"#N/A"}},{"$f":"MATCH(S$4,Millwall!$Z139:$AK139,0)","v":{"$error":"#N/A"}},{"$f":"MATCH(T$4,Millwall!$Z139:$AK139,0)","v":{"$error":"#N/A"}},{"$f":"MATCH(U$4,Millwall!$Z139:$AK139,0)","v":{"$error":"#N/A"}},{"$f":"MATCH(V$4,Millwall!$Z139:$AK139,0)","v":{"$error":"#N/A"}},{"$f":"MATCH(W$4,Millwall!$Z139:$AK139,0)","v":{"$error":"#N/A"}},{"$f":"MATCH(X$4,Millwall!$Z139:$AK139,0)","v":{"$error":"#N/A"}},{"$f":"MATCH(Y$4,Millwall!$Z139:$AK139,0)","v":{"$error":"#N/A"}},{"$f":"MATCH(Z$4,Millwall!$Z139:$AK139,0)","v":{"$error":"#N/A"}},{"$f":"MATCH(AA$4,Millwall!$Z139:$AK139,0)","v":{"$error":"#N/A"}},{"$f":"MATCH(AB$4,Millwall!$Z139:$AK139,0)","v":{"$error":"#N/A"}},{"$f":"MATCH(AC$4,Millwall!$Z139:$AK139,0)","v":{"$error":"#N/A"}},{"$f":"MATCH(AD$4,Millwall!$Z139:$AK139,0)","v":{"$error":"#N/A"}},{"$f":"MATCH(AE$4,Millwall!$Z139:$AK139,0)","v":{"$error":"#N/A"}},{"$f":"MATCH(AF$4,Millwall!$Z139:$AK139,0)","v":{"$error":"#N/A"}},{"$f":"MATCH(AG$4,Millwall!$Z139:$AK139,0)","v":{"$error":"#N/A"}},{"$f":"MATCH(AH$3,Millwall!$Z139:$AK139,0)","v":{"$error":"#N/A"}},{"$f":"MATCH(AI$3,Millwall!$Z139:$AK139,0)","v":{"$error":"#N/A"}},{"$f":"MATCH(AJ$3,Millwall!$Z139:$AK139,0)","v":{"$error":"#N/A"}},{"$f":"MATCH(AK$3,Millwall!$Z139:$AK139,0)","v":{"$error":"#N/A"}},{"$f":"MATCH(AL$3,Millwall!$Z139:$AK139,0)","v":{"$error":"#N/A"}},{"$f":"MATCH(AM$3,Millwall!$Z139:$AK139,0)","v":{"$error":"#N/A"}},{"$f":"MATCH(AN$3,Millwall!$Z139:$AK139,0)","v":{"$error":"#N/A"}},{"$f":"MATCH(AO$3,Millwall!$Z139:$AK139,0)","v":{"$error":"#N/A"}},{"$f":"MATCH(AP$3,Millwall!$Z139:$AK139,0)","v":{"$error":"#N/A"}},{"$f":"MATCH(AQ$3,Millwall!$Z139:$AK139,0)","v":{"$error":"#N/A"}},{"$f":"MATCH(AR$3,Millwall!$Z139:$AK139,0)","v":{"$error":"#N/A"}},null,null,null,null,null,{"$f":"MATCH(AX$3,Millwall!$Z139:AK139,0)","v":{"$error":"#N/A"}},{"$f":"MATCH(AY$3,Millwall!$Z139:AK139,0)","v":{"$error":"#N/A"}},{"$f":"MATCH(AZ$3,Millwall!$Z139:AK139,0)","v":{"$error":"#N/A"}},{"$f":"MATCH(BA$3,Millwall!$Z139:AK139,0)","v":{"$error":"#N/A"}},{"$f":"MATCH(BB$3,Millwall!$Z139:AK139,0)","v":{"$error":"#N/A"}},{"$f":"MATCH(BC$3,Millwall!$Z139:AK139,0)","v":{"$error":"#N/A"}},{"$f":"MATCH(BD$3,Millwall!$Z139:AK139,0)","v":{"$error":"#N/A"}},{"$f":"MATCH(BE$3,Millwall!$Z139:AK139,0)","v":{"$error":"#N/A"}},{"$f":"MATCH(BF$3,Millwall!$Z139:AK139,0)","v":{"$error":"#N/A"}},{"$f":"MATCH(BG$3,Millwall!$Z139:AK139,0)","v":{"$error":"#N/A"}},{"$f":"MATCH(BH$3,Millwall!$Z139:AK139,0)","v":{"$error":"#N/A"}},{"$f":"MATCH(BI$3,Millwall!$Z139:AK139,0)","v":{"$error":"#N/A"}},{"$f":"MATCH(BJ$3,Millwall!$Z139:AK139,0)","v":{"$error":"#N/A"}},{"$f":"MATCH(BK$3,Millwall!$Z139:AK139,0)","v":{"$error":"#N/A"}},{"$f":"MATCH(BL$3,Millwall!$Z139:AK139,0)","v":{"$error":"#N/A"}},{"$f":"MATCH(BM$3,Millwall!$Z139:AK139,0)","v":{"$error":"#N/A"}},{"$f":"MATCH(BN$3,Millwall!$Z139:AK139,0)","v":{"$error":"#N/A"}},{"$f":"MATCH(BO$3,Millwall!$Z139:AK139,0)","v":{"$error":"#N/A"}},{"$f":"MATCH(BP$3,Millwall!$Z139:AK139,0)","v":{"$error":"#N/A"}},{"$f":"MATCH(BQ$3,Millwall!$Z139:AK139,0)","v":{"$error":"#N/A"}},{"$f":"MATCH(BR$3,Millwall!$Z139:AK139,0)","v":{"$error":"#N/A"}},{"$f":"MATCH(BS$3,Millwall!$Z139:AK139,0)","v":{"$error":"#N/A"}},{"$f":"MATCH(BT$3,Millwall!$Z139:AK139,0)","v":{"$error":"#N/A"}},{"$f":"MATCH(BU$3,Millwall!$Z139:AK139,0)","v":{"$error":"#N/A"}},{"$f":"MATCH(BV$3,Millwall!$Z139:AK139,0)","v":{"$error":"#N/A"}},{"$f":"MATCH(BW$3,Millwall!$Z139:AK139,0)","v":{"$error":"#N/A"}},{"$f":"MATCH(BX$3,Millwall!$Z139:AK139,0)","v":{"$error":"#N/A"}},{"$f":"MATCH(BY$3,Millwall!$Z139:AK139,0)","v":{"$error":"#N/A"}},{"$f":"MATCH(BZ$3,Millwall!$Z139:AK139,0)","v":{"$error":"#N/A"}},{"$f":"MATCH(CA$3,Millwall!$Z139:AK139,0)","v":{"$error":"#N/A"}},{"$f":"MATCH(CB$3,Millwall!$Z139:AK139,0)","v":{"$error":"#N/A"}},{"$f":"MATCH(CC$3,Millwall!$Z139:AK139,0)","v":{"$error":"#N/A"}},{"$f":"MATCH(CD$3,Millwall!$Z139:AK139,0)","v":{"$error":"#N/A"}},{"$f":"MATCH(CE$3,Millwall!$Z139:AK139,0)","v":{"$error":"#N/A"}}]
[null,null,1,null,null,{"$f":"Millwall!V140","v":"00:00:00"},null,{"$f":"Millwall!W140","v":"00:00:00"},{"$f":"Millwall!X140","v":"00:00:00"},{"$f":"Millwall!Y140","v":0},{"$f":"MATCH(K$4,Millwall!$Z140:$AK140,0)","v":{"$error":"#N/A"}},{"$f":"MATCH(L$4,Millwall!$Z140:$AK140,0)","v":{"$error":"#N/A"}},{"$f":"MATCH(M$4,Millwall!$Z140:$AK140,0)","v":{"$error":"#N/A"}},{"$f":"MATCH(N$4,Millwall!$Z140:$AK140,0)","v":{"$error":"#N/A"}},{"$f":"MATCH(O$4,Millwall!$Z140:$AK140,0)","v":{"$error":"#N/A"}},{"$f":"MATCH(P$4,Millwall!$Z140:$AK140,0)","v":{"$error":"#N/A"}},{"$f":"MATCH(Q$4,Millwall!$Z140:$AK140,0)","v":{"$error":"#N/A"}},{"$f":"MATCH(R$4,Millwall!$Z140:$AK140,0)","v":{"$error":"#N/A"}},{"$f":"MATCH(S$4,Millwall!$Z140:$AK140,0)","v":{"$error":"#N/A"}},{"$f":"MATCH(T$4,Millwall!$Z140:$AK140,0)","v":{"$error":"#N/A"}},{"$f":"MATCH(U$4,Millwall!$Z140:$AK140,0)","v":{"$error":"#N/A"}},{"$f":"MATCH(V$4,Millwall!$Z140:$AK140,0)","v":{"$error":"#N/A"}},{"$f":"MATCH(W$4,Millwall!$Z140:$AK140,0)","v":{"$error":"#N/A"}},{"$f":"MATCH(X$4,Millwall!$Z140:$AK140,0)","v":{"$error":"#N/A"}},{"$f":"MATCH(Y$4,Millwall!$Z140:$AK140,0)","v":{"$error":"#N/A"}},{"$f":"MATCH(Z$4,Millwall!$Z140:$AK140,0)","v":{"$error":"#N/A"}},{"$f":"MATCH(AA$4,Millwall!$Z140:$AK140,0)","v":{"$error":"#N/A"}},{"$f":"MATCH(AB$4,Millwall!$Z140:$AK140,0)","v":{"$error":"#N/A"}},{"$f":"MATCH(AC$4,Millwall!$Z140:$AK140,0)","v":{"$error":"#N/A"}},{"$f":"MATCH(AD$4,Millwall!$Z140:$AK140,0)","v":{"$error":"#N/A"}},{"$f":"MATCH(AE$4,Millwall!$Z140:$AK140,0)","v":{"$error":"#N/A"}},{"$f":"MATCH(AF$4,Millwall!$Z140:$AK140,0)","v":{"$error":"#N/A"}},{"$f":"MATCH(AG$4,Millwall!$Z140:$AK140,0)","v":{"$error":"#N/A"}},{"$f":"MATCH(AH$3,Millwall!$Z140:$AK140,0)","v":{"$error":"#N/A"}},{"$f":"MATCH(AI$3,Millwall!$Z140:$AK140,0)","v":{"$error":"#N/A"}},{"$f":"MATCH(AJ$3,Millwall!$Z140:$AK140,0)","v":{"$error":"#N/A"}},{"$f":"MATCH(AK$3,Millwall!$Z140:$AK140,0)","v":{"$error":"#N/A"}},{"$f":"MATCH(AL$3,Millwall!$Z140:$AK140,0)","v":{"$error":"#N/A"}},{"$f":"MATCH(AM$3,Millwall!$Z140:$AK140,0)","v":{"$error":"#N/A"}},{"$f":"MATCH(AN$3,Millwall!$Z140:$AK140,0)","v":{"$error":"#N/A"}},{"$f":"MATCH(AO$3,Millwall!$Z140:$AK140,0)","v":{"$error":"#N/A"}},{"$f":"MATCH(AP$3,Millwall!$Z140:$AK140,0)","v":{"$error":"#N/A"}},{"$f":"MATCH(AQ$3,Millwall!$Z140:$AK140,0)","v":{"$error":"#N/A"}},{"$f":"MATCH(AR$3,Millwall!$Z140:$AK140,0)","v":{"$error":"#N/A"}},null,null,null,null,null,{"$f":"MATCH(AX$3,Millwall!$Z140:AK140,0)","v":{"$error":"#N/A"}},{"$f":"MATCH(AY$3,Millwall!$Z140:AK140,0)","v":{"$error":"#N/A"}},{"$f":"MATCH(AZ$3,Millwall!$Z140:AK140,0)","v":{"$error":"#N/A"}},{"$f":"MATCH(BA$3,Millwall!$Z140:AK140,0)","v":{"$error":"#N/A"}},{"$f":"MATCH(BB$3,Millwall!$Z140:AK140,0)","v":{"$error":"#N/A"}},{"$f":"MATCH(BC$3,Millwall!$Z140:AK140,0)","v":{"$error":"#N/A"}},{"$f":"MATCH(BD$3,Millwall!$Z140:AK140,0)","v":{"$error":"#N/A"}},{"$f":"MATCH(BE$3,Millwall!$Z140:AK140,0)","v":{"$error":"#N/A"}},{"$f":"MATCH(BF$3,Millwall!$Z140:AK140,0)","v":{"$error":"#N/A"}},{"$f":"MATCH(BG$3,Millwall!$Z140:AK140,0)","v":{"$error":"#N/A"}},{"$f":"MATCH(BH$3,Millwall!$Z140:AK140,0)","v":{"$error":"#N/A"}},{"$f":"MATCH(BI$3,Millwall!$Z140:AK140,0)","v":{"$error":"#N/A"}},{"$f":"MATCH(BJ$3,Millwall!$Z140:AK140,0)","v":{"$error":"#N/A"}},{"$f":"MATCH(BK$3,Millwall!$Z140:AK140,0)","v":{"$error":"#N/A"}},{"$f":"MATCH(BL$3,Millwall!$Z140:AK140,0)","v":{"$error":"#N/A"}},{"$f":"MATCH(BM$3,Millwall!$Z140:AK140,0)","v":{"$error":"#N/A"}},{"$f":"MATCH(BN$3,Millwall!$Z140:AK140,0)","v":{"$error":"#N/A"}},{"$f":"MATCH(BO$3,Millwall!$Z140:AK140,0)","v":{"$error":"#N/A"}},{"$f":"MATCH(BP$3,Millwall!$Z140:AK140,0)","v":{"$error":"#N/A"}},{"$f":"MATCH(BQ$3,Millwall!$Z140:AK140,0)","v":{"$error":"#N/A"}},{"$f":"MATCH(BR$3,Millwall!$Z140:AK140,0)","v":{"$error":"#N/A"}},{"$f":"MATCH(BS$3,Millwall!$Z140:AK140,0)","v":{"$error":"#N/A"}},{"$f":"MATCH(BT$3,Millwall!$Z140:AK140,0)","v":{"$error":"#N/A"}},{"$f":"MATCH(BU$3,Millwall!$Z140:AK140,0)","v":{"$error":"#N/A"}},{"$f":"MATCH(BV$3,Millwall!$Z140:AK140,0)","v":{"$error":"#N/A"}},{"$f":"MATCH(BW$3,Millwall!$Z140:AK140,0)","v":{"$error":"#N/A"}},{"$f":"MATCH(BX$3,Millwall!$Z140:AK140,0)","v":{"$error":"#N/A"}},{"$f":"MATCH(BY$3,Millwall!$Z140:AK140,0)","v":{"$error":"#N/A"}},{"$f":"MATCH(BZ$3,Millwall!$Z140:AK140,0)","v":{"$error":"#N/A"}},{"$f":"MATCH(CA$3,Millwall!$Z140:AK140,0)","v":{"$error":"#N/A"}},{"$f":"MATCH(CB$3,Millwall!$Z140:AK140,0)","v":{"$error":"#N/A"}},{"$f":"MATCH(CC$3,Millwall!$Z140:AK140,0)","v":{"$error":"#N/A"}},{"$f":"MATCH(CD$3,Millwall!$Z140:AK140,0)","v":{"$error":"#N/A"}},{"$f":"MATCH(CE$3,Millwall!$Z140:AK140,0)","v":{"$error":"#N/A"}}]
[null,null,1,null,null,{"$f":"Millwall!V141","v":"00:00:00"},null,{"$f":"Millwall!W141","v":"00:00:00"},{"$f":"Millwall!X141","v":"00:00:00"},{"$f":"Millwall!Y141","v":0},{"$f":"MATCH(K$4,Millwall!$Z141:$AK141,0)","v":{"$error":"#N/A"}},{"$f":"MATCH(L$4,Millwall!$Z141:$AK141,0)","v":{"$error":"#N/A"}},{"$f":"MATCH(M$4,Millwall!$Z141:$AK141,0)","v":{"$error":"#N/A"}},{"$f":"MATCH(N$4,Millwall!$Z141:$AK141,0)","v":{"$error":"#N/A"}},{"$f":"MATCH(O$4,Millwall!$Z141:$AK141,0)","v":{"$error":"#N/A"}},{"$f":"MATCH(P$4,Millwall!$Z141:$AK141,0)","v":{"$error":"#N/A"}},{"$f":"MATCH(Q$4,Millwall!$Z141:$AK141,0)","v":{"$error":"#N/A"}},{"$f":"MATCH(R$4,Millwall!$Z141:$AK141,0)","v":{"$error":"#N/A"}},{"$f":"MATCH(S$4,Millwall!$Z141:$AK141,0)","v":{"$error":"#N/A"}},{"$f":"MATCH(T$4,Millwall!$Z141:$AK141,0)","v":{"$error":"#N/A"}},{"$f":"MATCH(U$4,Millwall!$Z141:$AK141,0)","v":{"$error":"#N/A"}},{"$f":"MATCH(V$4,Millwall!$Z141:$AK141,0)","v":{"$error":"#N/A"}},{"$f":"MATCH(W$4,Millwall!$Z141:$AK141,0)","v":{"$error":"#N/A"}},{"$f":"MATCH(X$4,Millwall!$Z141:$AK141,0)","v":{"$error":"#N/A"}},{"$f":"MATCH(Y$4,Millwall!$Z141:$AK141,0)","v":{"$error":"#N/A"}},{"$f":"MATCH(Z$4,Millwall!$Z141:$AK141,0)","v":{"$error":"#N/A"}},{"$f":"MATCH(AA$4,Millwall!$Z141:$AK141,0)","v":{"$error":"#N/A"}},{"$f":"MATCH(AB$4,Millwall!$Z141:$AK141,0)","v":{"$error":"#N/A"}},{"$f":"MATCH(AC$4,Millwall!$Z141:$AK141,0)","v":{"$error":"#N/A"}},{"$f":"MATCH(AD$4,Millwall!$Z141:$AK141,0)","v":{"$error":"#N/A"}},{"$f":"MATCH(AE$4,Millwall!$Z141:$AK141,0)","v":{"$error":"#N/A"}},{"$f":"MATCH(AF$4,Millwall!$Z141:$AK141,0)","v":{"$error":"#N/A"}},{"$f":"MATCH(AG$4,Millwall!$Z141:$AK141,0)","v":{"$error":"#N/A"}},{"$f":"MATCH(AH$3,Millwall!$Z141:$AK141,0)","v":{"$error":"#N/A"}},{"$f":"MATCH(AI$3,Millwall!$Z141:$AK141,0)","v":{"$error":"#N/A"}},{"$f":"MATCH(AJ$3,Millwall!$Z141:$AK141,0)","v":{"$error":"#N/A"}},{"$f":"MATCH(AK$3,Millwall!$Z141:$AK141,0)","v":{"$error":"#N/A"}},{"$f":"MATCH(AL$3,Millwall!$Z141:$AK141,0)","v":{"$error":"#N/A"}},{"$f":"MATCH(AM$3,Millwall!$Z141:$AK141,0)","v":{"$error":"#N/A"}},{"$f":"MATCH(AN$3,Millwall!$Z141:$AK141,0)","v":{"$error":"#N/A"}},{"$f":"MATCH(AO$3,Millwall!$Z141:$AK141,0)","v":{"$error":"#N/A"}},{"$f":"MATCH(AP$3,Millwall!$Z141:$AK141,0)","v":{"$error":"#N/A"}},{"$f":"MATCH(AQ$3,Millwall!$Z141:$AK141,0)","v":{"$error":"#N/A"}},{"$f":"MATCH(AR$3,Millwall!$Z141:$AK141,0)","v":{"$error":"#N/A"}},null,null,null,null,null,{"$f":"MATCH(AX$3,Millwall!$Z141:AK141,0)","v":{"$error":"#N/A"}},{"$f":"MATCH(AY$3,Millwall!$Z141:AK141,0)","v":{"$error":"#N/A"}},{"$f":"MATCH(AZ$3,Millwall!$Z141:AK141,0)","v":{"$error":"#N/A"}},{"$f":"MATCH(BA$3,Millwall!$Z141:AK141,0)","v":{"$error":"#N/A"}},{"$f":"MATCH(BB$3,Millwall!$Z141:AK141,0)","v":{"$error":"#N/A"}},{"$f":"MATCH(BC$3,Millwall!$Z141:AK141,0)","v":{"$error":"#N/A"}},{"$f":"MATCH(BD$3,Millwall!$Z141:AK141,0)","v":{"$error":"#N/A"}},{"$f":"MATCH(BE$3,Millwall!$Z141:AK141,0)","v":{"$error":"#N/A"}},{"$f":"MATCH(BF$3,Millwall!$Z141:AK141,0)","v":{"$error":"#N/A"}},{"$f":"MATCH(BG$3,Millwall!$Z141:AK141,0)","v":{"$error":"#N/A"}},{"$f":"MATCH(BH$3,Millwall!$Z141:AK141,0)","v":{"$error":"#N/A"}},{"$f":"MATCH(BI$3,Millwall!$Z141:AK141,0)","v":{"$error":"#N/A"}},{"$f":"MATCH(BJ$3,Millwall!$Z141:AK141,0)","v":{"$error":"#N/A"}},{"$f":"MATCH(BK$3,Millwall!$Z141:AK141,0)","v":{"$error":"#N/A"}},{"$f":"MATCH(BL$3,Millwall!$Z141:AK141,0)","v":{"$error":"#N/A"}},{"$f":"MATCH(BM$3,Millwall!$Z141:AK141,0)","v":{"$error":"#N/A"}},{"$f":"MATCH(BN$3,Millwall!$Z141:AK141,0)","v":{"$error":"#N/A"}},{"$f":"MATCH(BO$3,Millwall!$Z141:AK141,0)","v":{"$error":"#N/A"}},{"$f":"MATCH(BP$3,Millwall!$Z141:AK141,0)","v":{"$error":"#N/A"}},{"$f":"MATCH(BQ$3,Millwall!$Z141:AK141,0)","v":{"$error":"#N/A"}},{"$f":"MATCH(BR$3,Millwall!$Z141:AK141,0)","v":{"$error":"#N/A"}},{"$f":"MATCH(BS$3,Millwall!$Z141:AK141,0)","v":{"$error":"#N/A"}},{"$f":"MATCH(BT$3,Millwall!$Z141:AK141,0)","v":{"$error":"#N/A"}},{"$f":"MATCH(BU$3,Millwall!$Z141:AK141,0)","v":{"$error":"#N/A"}},{"$f":"MATCH(BV$3,Millwall!$Z141:AK141,0)","v":{"$error":"#N/A"}},{"$f":"MATCH(BW$3,Millwall!$Z141:AK141,0)","v":{"$error":"#N/A"}},{"$f":"MATCH(BX$3,Millwall!$Z141:AK141,0)","v":{"$error":"#N/A"}},{"$f":"MATCH(BY$3,Millwall!$Z141:AK141,0)","v":{"$error":"#N/A"}},{"$f":"MATCH(BZ$3,Millwall!$Z141:AK141,0)","v":{"$error":"#N/A"}},{"$f":"MATCH(CA$3,Millwall!$Z141:AK141,0)","v":{"$error":"#N/A"}},{"$f":"MATCH(CB$3,Millwall!$Z141:AK141,0)","v":{"$error":"#N/A"}},{"$f":"MATCH(CC$3,Millwall!$Z141:AK141,0)","v":{"$error":"#N/A"}},{"$f":"MATCH(CD$3,Millwall!$Z141:AK141,0)","v":{"$error":"#N/A"}},{"$f":"MATCH(CE$3,Millwall!$Z141:AK141,0)","v":{"$error":"#N/A"}}]
[null,null,1,null,null,{"$f":"Millwall!V142","v":"00:00:00"},null,{"$f":"Millwall!W142","v":"00:00:00"},{"$f":"Millwall!X142","v":"00:00:00"},{"$f":"Millwall!Y142","v":0},{"$f":"MATCH(K$4,Millwall!$Z142:$AK142,0)","v":{"$error":"#N/A"}},{"$f":"MATCH(L$4,Millwall!$Z142:$AK142,0)","v":{"$error":"#N/A"}},{"$f":"MATCH(M$4,Millwall!$Z142:$AK142,0)","v":{"$error":"#N/A"}},{"$f":"MATCH(N$4,Millwall!$Z142:$AK142,0)","v":{"$error":"#N/A"}},{"$f":"MATCH(O$4,Millwall!$Z142:$AK142,0)","v":{"$error":"#N/A"}},{"$f":"MATCH(P$4,Millwall!$Z142:$AK142,0)","v":{"$error":"#N/A"}},{"$f":"MATCH(Q$4,Millwall!$Z142:$AK142,0)","v":{"$error":"#N/A"}},{"$f":"MATCH(R$4,Millwall!$Z142:$AK142,0)","v":{"$error":"#N/A"}},{"$f":"MATCH(S$4,Millwall!$Z142:$AK142,0)","v":{"$error":"#N/A"}},{"$f":"MATCH(T$4,Millwall!$Z142:$AK142,0)","v":{"$error":"#N/A"}},{"$f":"MATCH(U$4,Millwall!$Z142:$AK142,0)","v":{"$error":"#N/A"}},{"$f":"MATCH(V$4,Millwall!$Z142:$AK142,0)","v":{"$error":"#N/A"}},{"$f":"MATCH(W$4,Millwall!$Z142:$AK142,0)","v":{"$error":"#N/A"}},{"$f":"MATCH(X$4,Millwall!$Z142:$AK142,0)","v":{"$error":"#N/A"}},{"$f":"MATCH(Y$4,Millwall!$Z142:$AK142,0)","v":{"$error":"#N/A"}},{"$f":"MATCH(Z$4,Millwall!$Z142:$AK142,0)","v":{"$error":"#N/A"}},{"$f":"MATCH(AA$4,Millwall!$Z142:$AK142,0)","v":{"$error":"#N/A"}},{"$f":"MATCH(AB$4,Millwall!$Z142:$AK142,0)","v":{"$error":"#N/A"}},{"$f":"MATCH(AC$4,Millwall!$Z142:$AK142,0)","v":{"$error":"#N/A"}},{"$f":"MATCH(AD$4,Millwall!$Z142:$AK142,0)","v":{"$error":"#N/A"}},{"$f":"MATCH(AE$4,Millwall!$Z142:$AK142,0)","v":{"$error":"#N/A"}},{"$f":"MATCH(AF$4,Millwall!$Z142:$AK142,0)","v":{"$error":"#N/A"}},{"$f":"MATCH(AG$4,Millwall!$Z142:$AK142,0)","v":{"$error":"#N/A"}},{"$f":"MATCH(AH$3,Millwall!$Z142:$AK142,0)","v":{"$error":"#N/A"}},{"$f":"MATCH(AI$3,Millwall!$Z142:$AK142,0)","v":{"$error":"#N/A"}},{"$f":"MATCH(AJ$3,Millwall!$Z142:$AK142,0)","v":{"$error":"#N/A"}},{"$f":"MATCH(AK$3,Millwall!$Z142:$AK142,0)","v":{"$error":"#N/A"}},{"$f":"MATCH(AL$3,Millwall!$Z142:$AK142,0)","v":{"$error":"#N/A"}},{"$f":"MATCH(AM$3,Millwall!$Z142:$AK142,0)","v":{"$error":"#N/A"}},{"$f":"MATCH(AN$3,Millwall!$Z142:$AK142,0)","v":{"$error":"#N/A"}},{"$f":"MATCH(AO$3,Millwall!$Z142:$AK142,0)","v":{"$error":"#N/A"}},{"$f":"MATCH(AP$3,Millwall!$Z142:$AK142,0)","v":{"$error":"#N/A"}},{"$f":"MATCH(AQ$3,Millwall!$Z142:$AK142,0)","v":{"$error":"#N/A"}},{"$f":"MATCH(AR$3,Millwall!$Z142:$AK142,0)","v":{"$error":"#N/A"}},null,null,null,null,null,{"$f":"MATCH(AX$3,Millwall!$Z142:AK142,0)","v":{"$error":"#N/A"}},{"$f":"MATCH(AY$3,Millwall!$Z142:AK142,0)","v":{"$error":"#N/A"}},{"$f":"MATCH(AZ$3,Millwall!$Z142:AK142,0)","v":{"$error":"#N/A"}},{"$f":"MATCH(BA$3,Millwall!$Z142:AK142,0)","v":{"$error":"#N/A"}},{"$f":"MATCH(BB$3,Millwall!$Z142:AK142,0)","v":{"$error":"#N/A"}},{"$f":"MATCH(BC$3,Millwall!$Z142:AK142,0)","v":{"$error":"#N/A"}},{"$f":"MATCH(BD$3,Millwall!$Z142:AK142,0)","v":{"$error":"#N/A"}},{"$f":"MATCH(BE$3,Millwall!$Z142:AK142,0)","v":{"$error":"#N/A"}},{"$f":"MATCH(BF$3,Millwall!$Z142:AK142,0)","v":{"$error":"#N/A"}},{"$f":"MATCH(BG$3,Millwall!$Z142:AK142,0)","v":{"$error":"#N/A"}},{"$f":"MATCH(BH$3,Millwall!$Z142:AK142,0)","v":{"$error":"#N/A"}},{"$f":"MATCH(BI$3,Millwall!$Z142:AK142,0)","v":{"$error":"#N/A"}},{"$f":"MATCH(BJ$3,Millwall!$Z142:AK142,0)","v":{"$error":"#N/A"}},{"$f":"MATCH(BK$3,Millwall!$Z142:AK142,0)","v":{"$error":"#N/A"}},{"$f":"MATCH(BL$3,Millwall!$Z142:AK142,0)","v":{"$error":"#N/A"}},{"$f":"MATCH(BM$3,Millwall!$Z142:AK142,0)","v":{"$error":"#N/A"}},{"$f":"MATCH(BN$3,Millwall!$Z142:AK142,0)","v":{"$error":"#N/A"}},{"$f":"MATCH(BO$3,Millwall!$Z142:AK142,0)","v":{"$error":"#N/A"}},{"$f":"MATCH(BP$3,Millwall!$Z142:AK142,0)","v":{"$error":"#N/A"}},{"$f":"MATCH(BQ$3,Millwall!$Z142:AK142,0)","v":{"$error":"#N/A"}},{"$f":"MATCH(BR$3,Millwall!$Z142:AK142,0)","v":{"$error":"#N/A"}},{"$f":"MATCH(BS$3,Millwall!$Z142:AK142,0)","v":{"$error":"#N/A"}},{"$f":"MATCH(BT$3,Millwall!$Z142:AK142,0)","v":{"$error":"#N/A"}},{"$f":"MATCH(BU$3,Millwall!$Z142:AK142,0)","v":{"$error":"#N/A"}},{"$f":"MATCH(BV$3,Millwall!$Z142:AK142,0)","v":{"$error":"#N/A"}},{"$f":"MATCH(BW$3,Millwall!$Z142:AK142,0)","v":{"$error":"#N/A"}},{"$f":"MATCH(BX$3,Millwall!$Z142:AK142,0)","v":{"$error":"#N/A"}},{"$f":"MATCH(BY$3,Millwall!$Z142:AK142,0)","v":{"$error":"#N/A"}},{"$f":"MATCH(BZ$3,Millwall!$Z142:AK142,0)","v":{"$error":"#N/A"}},{"$f":"MATCH(CA$3,Millwall!$Z142:AK142,0)","v":{"$error":"#N/A"}},{"$f":"MATCH(CB$3,Millwall!$Z142:AK142,0)","v":{"$error":"#N/A"}},{"$f":"MATCH(CC$3,Millwall!$Z142:AK142,0)","v":{"$error":"#N/A"}},{"$f":"MATCH(CD$3,Millwall!$Z142:AK142,0)","v":{"$error":"#N/A"}},{"$f":"MATCH(CE$3,Millwall!$Z142:AK142,0)","v":{"$error":"#N/A"}}]
[]
[null,null,null,null,null,null,null,null,null,"Total League Cup Apperances",{"$f":"COUNT(K70:K76)","v":0},0,1,0,0,0,1,0,0,1,1,0,0,1,1,0,1,1,1,0,1,1,0,0,0,0,0,0,0,0,0,0,0,0]
[null,null,null,null,null,null,null,null,null,"Total League Cup Substitute Appearences ",{"$f":"COUNTIF(K70:K76,\">=12\")","v":0},{"$f":"COUNTIF(L70:L76,\">=12\")","v":0},0,0,0,0,0,0,0,0,0,0,0,0,0,0,0,0,0,0,0,0,0,0,0,0,0,0,0,0,0,0,0,0]
[null,null,null,null,null,null,null,null,null,"Goals",{"$f":"Millwall!$CD$6","v":0},{"$f":"Millwall!$CD$7","v":0},{"$f":"Millwall!$CD$8","v":0},{"$f":"Millwall!$CD$9","v":0},{"$f":"Millwall!$CD$10","v":0},{"$f":"Millwall!$CD$11","v":0},{"$f":"Millwall!$CD$12","v":0},{"$f":"Millwall!$CD$13","v":0},{"$f":"Millwall!$CD$14","v":0},{"$f":"Millwall!$CD$15","v":0},{"$f":"Millwall!$CD$16","v":0},{"$f":"Millwall!$CD$17","v":0},{"$f":"Millwall!$CD$18","v":0},{"$f":"Millwall!$CD$19","v":0},{"$f":"Millwall!$CD$20","v":0},{"$f":"Millwall!$CD$21","v":0},{"$f":"Millwall!$CD$22","v":0},{"$f":"Millwall!$CD$23","v":0},{"$f":"Millwall!$CD$24","v":0},{"$f":"Millwall!$CD$25","v":0},{"$f":"Millwall!$CD$26","v":0},{"$f":"Millwall!$CD$27","v":0},{"$f":"Millwall!$CD$28","v":0},{"$f":"Millwall!$CD$29","v":0},{"$f":"Millwall!$CD$30","v":0},{"$f":"Millwall!$CD$33","v":0},{"$f":"Millwall!$CD$34","v":0},{"$f":"Millwall!$CD$35","v":0},{"$f":"Millwall!$CD$36","v":0},{"$f":"Millwall!$CD$37","v":0},{"$f":"Millwall!$CD$38","v":0},{"$f":"Millwall!$CD$39","v":0},{"$f":"Millwall!$CD$40","v":0},{"$f":"Millwall!$CD$41","v":0}]
[]
[null,null,1]
[null,null,1]
[null,null,1]
[null,null,1]
[null,null,1]
[null,null,1]
[null,null,1]
[null,null,1]
[]
[]
[null,null,null,null,null,null,null,"Checks",null,null,null,null,null,null,null,null,null,null,1]
[]
["Manual Input",null,null,null,null,null,null,"Opponents","Venue/Result",null,{"$f":"K3","v":"Allder"},"Baldwin","Bolland","B Brown","S Brown","Burnett","Clark","Cripps","Dillon","Donaldson","Dorney","Evans","Hazell","Hill","Jones","C Kelly","M Kelly","King","Kitchener","Moore","Saul","Smethurst","Smith","Summerill","Wood",0,0,0,0,0,0,0,0,0]
[null,null,{"$f":"IF(J95=0,1,0)","v":0},1,null,{"$f":"F5","v":"1974-08-17"},null,{"$f":"H5","v":"Sunderland"},"(H)","L 1-4",6,null,null,2,null,null,10,3,null,4,5,null,null,11,null,null,null,1,null,null,7,8,null,null,9]
[null,null,0,2,null,"1974-08-19",null,"Nottm Forest","(H)","W 3-0",null,null,null,3,12,null,9,null,null,2,4,null,null,11,null,null,10,1,5,null,6,7,null,null,8]
[null,null,0,3,null,"1974-08-24",null,"Man Utd","(A)","L 0-4",null,null,12,3,null,null,9,null,null,2,4,null,null,11,null,null,10,1,5,null,6,7,null,null,8]
[null,null,0,4,null,"1974-08-27",null,"Nottm Forest","(A)","L 1-2",null,null,9,3,null,null,null,null,null,2,4,null,null,11,null,null,10,1,5,null,6,7,null,null,8]
[null,null,0,5,null,"1974-08-31",null,"Fulham","(H)","W 2-0",null,null,10,null,null,null,null,null,null,2,4,null,null,11,3,null,8,1,5,null,6,7,null,null,9]
[null,null,0,6,null,"1974-09-07",null,"Blackpool","(A)","L 0-1",12,null,8,null,null,null,null,null,null,2,4,null,null,11,3,null,10,1,5,null,6,7,null,null,9]
[null,null,0,7,null,"1974-09-14",null,"Oxford","(H)","D 0-0",null,null,8,null,null,null,12,null,null,2,4,null,null,11,3,null,10,1,5,null,6,7,null,null,9]
[null,null,0,8,null,"1974-09-16",null,"Man Utd","(H)","L 0-1",10,null,7,null,null,null,8,null,null,2,4,null,null,11,3,null,null,1,5,null,6,null,null,null,9]
[null,null,0,9,null,"1974-09-21",null,"Aston Villa","(A)","L 0-3",6,null,10,null,null,null,12,null,null,2,4,null,null,11,3,null,null,1,5,null,7,8]
[null,null,0,10,null,"1974-09-24",null,"Hull City","(A)","D 1-1",10,null,7,2,null,null,null,null,null,4,6,null,null,11,3,null,null,1,5,null,8,9]
[null,null,0,11,null,"1974-09-28",null,"Bristol C","(H)","W 1-0",10,null,9,2,null,null,null,null,null,4,6,null,null,11,3,null,null,1,5,null,7,8]
[null,null,0,12,null,"1974-10-05",null,"Norwich","(A)","L 0-2",10,null,8,2,null,null,null,null,null,4,6,null,null,11,3,null,null,1,5,null,7,null,null,null,9]
[null,null,0,13,null,"1974-10-12",null,"Southampton","(H)","W 4-0",11,null,10,2,null,null,8,null,null,4,6,null,null,null,3,null,null,1,5,null,7,null,null,null,9]
[null,null,0,14,null,"1974-10-19",null,"Bristol R","(A)","L 0-2",11,null,7,2,null,null,10,null,null,4,6,null,null,12,3,null,null,1,5,null,8,null,null,null,9]
[null,null,0,15,null,"1974-10-26",null,"West Brom","(H)","D 2-2",6,null,10,null,12,null,8,null,null,2,4,null,null,11,3,null,null,1,5,null,7,null,null,null,9]
[null,null,0,16,null,"1974-11-02",null,"Oldham","(A)","D 1-1",7,null,10,null,12,null,8,null,null,2,4,null,null,11,3,null,null,1,5,null,6,null,null,null,9]
[null,null,0,17,null,"1974-11-09",null,{"$f":"H21","v":"Bolton"},"(H)","D 1-1",6,null,10,null,12,null,8,null,null,2,4,null,null,11,3,null,null,1,5,null,7,null,null,null,9]
[null,null,0,18,null,"1974-11-16",null,"York","(A)","L 1-2",6,null,10,null,9,null,8,null,null,2,4,null,null,11,3,null,null,1,5,null,7]
[null,null,0,19,null,"1974-11-30",null,"Notts Co","(A)","L 1-2",6,9,10,null,null,null,12,null,null,2,4,null,null,11,3,null,null,1,5,null,7,null,null,8]
[null,null,0,20,null,"1974-12-07",null,"Orient","(H)","D 1-1",10,9,7,null,null,null,null,null,5,2,4,null,null,11,3,null,null,1,null,null,6,null,null,8]
[null,null,0,21,null,"1974-12-14",null,"Sunderland","(A)","L 0-2",10,9,7,null,null,null,12,null,4,2,5,null,null,11,null,null,null,1,null,3,6,null,null,8]
[null,null,0,22,null,"1974-12-21",null,"Sheff Wed","(H)","W 2-1",10,9,7,null,null,null,null,null,11,null,4,null,2,null,null,null,null,1,5,3,6,null,null,8]
[null,null,0,23,null,"1974-12-26",null,"Oxford","(A)","L 1-3",null,9,null,null,null,null,null,null,10,2,4,null,7,11,null,null,null,1,5,3,6,null,null,8]
[null,null,0,24,null,"1974-12-28",null,"Portsmouth","(H)","D 0-0",12,9,null,null,null,null,10,null,null,4,6,null,2,11,null,null,null,1,5,3,7]
[null,null,0,25,null,"1975-01-11",null,"Orient","(A)","L 1-2",12,null,8,null,null,null,9,null,null,2,4,null,7,11,null,null,null,1,5,3,6,null,null,10]
[null,null,0,26,null,"1975-01-18",null,"Notts Co","(H)","W 3-0",8,null,6,null,null,null,9,null,null,null,4,null,7,11,12,null,null,1,5,3,null,null,2,10]
[null,null,0,27,null,"1975-01-25",null,"Cardiff","(H)","W 5-1",11,null,8,null,null,null,9,null,null,null,null,7,4,null,null,null,null,1,5,3,6,null,2,10]
[null,null,0,28,null,"1975-02-01",null,"Bolton","(A)","L 0-2",11,null,8,null,null,null,9,null,null,null,null,4,6,null,null,12,null,1,5,3,7,null,2,10]
[null,null,0,29,null,"1975-02-08",null,"Oldham","(H)","D 0-0",6,null,null,null,null,null,9,null,null,null,null,4,7,12,null,11,null,1,5,3,8,null,2,10]
[null,null,0,30,null,"1975-02-14",null,"Cardiff","(A)","W 1-0",null,null,null,null,null,null,12,null,null,null,7,4,8,11,null,9,null,1,5,3,6,null,2]
[null,null,0,31,null,"1975-02-22",null,"York","(H)","L 1-3",11,null,8,null,null,null,null,null,null,null,6,2,4,null,null,9,null,1,5,3,7,null,null,10]
[null,null,0,32,null,"1975-03-04",null,"Fulham","(A)","D 0-0",12,null,null,null,null,null,null,null,null,2,4,null,7,null,8,9,null,1,5,3,6,11,null,10]
[null,null,0,33,null,"1975-03-08",null,{"$f":"H37","v":"Hull City"},"(H)","W 2-0",null,null,null,null,null,null,9,null,null,2,6,null,4,null,11,null,null,1,5,3,7,8,null,10]
[null,null,0,34,null,"1975-03-15",null,"Bristol C","(A)","L 1-2",null,null,null,null,null,null,9,null,null,2,4,null,7,null,8,12,null,1,5,3,6,11,null,10]
[null,null,0,35,null,"1975-03-22",null,"Blackpool","(H)","D 0-0",11,null,null,null,null,6,8,null,null,null,null,2,4,null,null,9,null,1,5,3,7,null,null,10]
[null,null,0,36,null,"1975-03-29",null,"Sheff Wed","(A)","W 1-0",null,null,null,null,null,4,8,null,null,null,11,2,7,12,null,9,null,1,5,3,6,null,null,10]
[null,null,0,37,null,"1975-03-31",null,"Portsmouth","(A)","L 0-1",null,null,null,null,null,8,null,null,null,null,4,2,7,11,null,9,null,1,5,3,6,null,null,10]
[null,null,0,38,null,"1975-04-01",null,"Aston Villa","(H)","L 1-3",11,null,10,null,null,4,8,null,null,null,null,2,7,12,null,9,null,1,5,3,6]
[null,null,0,39,null,"1975-04-05",null,"West Brom","(A)","L 1-2",12,null,11,null,null,7,8,null,null,null,null,2,4,null,null,9,null,1,5,3,6,null,null,null,null,null,null,null,null,null,null,null,null,null,null,null,null,"Errors in Goal Totals"]
[null,null,0,40,null,"1975-04-12",null,"Norwich","(H)","D 1-1",11,null,10,null,null,8,9,null,null,null,4,2,7,null,null,null,null,1,5,3,6]
[null,null,0,41,null,"1975-04-18",null,"Southampton","(A)","L 2-3",11,null,10,null,null,null,9,null,null,8,4,2,7,12,null,null,null,1,5,3,6]
[null,null,0,42,null,"1975-04-26",null,"Bristol R","(H)","D 1-1",10,null,null,null,null,null,9,null,null,8,4,2,7,11,null,null,null,1,5,3,6]
[null,null,1,43,null,"00:00:00",null,"00:00:00","00:00:00",0]
[null,null,1,44,null,"00:00:00",null,"00:00:00","00:00:00",0]
[null,null,{"$f":"IF(J139=0,1,0)","v":1},45,null,"00:00:00",null,"00:00:00","00:00:00",0]
[null,null,{"$f":"IF(J140=0,1,0)","v":1},46,null,"00:00:00",null,"00:00:00","00:00:00",0]
[]
[null,null,null,null,null,null,null,null,null,"Total League Apperances",{"$f":"COUNT(K95:K140)-K143","v":26},{"$f":"COUNT(L95:L140)-L143","v":6},28,9,1,6,25,1,4,29,36,13,21,26,19,9,6,42,39,22,41,13,5,17,14,0,0,0,0,0,0,0,0,0]
[null,null,null,null,null,null,null,null,null,"Total League Substitute Appearences ",{"$f":"COUNTIF(K95:K140,\">=12\")","v":5},0,{"$f":"COUNTIF(M95:M140,\">=12\")","v":1},{"$f":"COUNTIF(N95:N140,\">=12\")","v":0},4,0,5,0,0,0,0,0,0,5,1,2,0,0,0,0,0,0,0,0,0,0,0,0,0,0,0,0,0,0]
[null,null,null,null,null,null,null,null,null,"Goals",1,1,5,0,1,2,null,0,0,1,1,1,2,5,0,0,null,0,2,2,2,1,0,6,2,0,44,0,0,0,0,0,0,0]
[null,null,null,null,null,null,null,"FA Cup"]
[null,null,{"$f":"IF(J146=0,1,0)","v":0},{"$f":"D57","v":3},null,{"$f":"F57","v":"1975-01-04"},null,{"$f":"H57","v":"Bury"},"(A)","D 2-2",11,null,10,null,null,null,9,null,null,4,6,null,2,12,null,null,null,1,5,3,7,null,null,8]
[null,null,0,{"$f":"D58","v":"3R"},null,"1975-01-07",null,"Bury","(H)","D 1-1 *",12,null,8,null,null,null,9,null,null,2,4,null,7,11,null,null,null,1,5,3,6,null,null,10]
[null,null,0,"3R",null,"1975-01-13",null,"Bury","(N)","L 0-2",7,null,12,null,null,null,9,null,null,null,4,null,2,11,8,null,null,1,5,3,6,null,null,10]
[null,null,1,0,null,"00:00:00",null,"00:00:00","00:00:00",0]
[null,null,1,0,null,"00:00:00",null,"00:00:00","00:00:00",0]
[null,null,1,0,null,"00:00:00",null,"00:00:00","00:00:00",0]
[null,null,1,0,null,"00:00:00",null,"00:00:00","00:00:00",0]
[]
[null,null,null,null,null,null,null,null,null,"Total FA Cup Apperances",{"$f":"COUNT(K146:K152)-K155","v":2},{"$f":"COUNT(L146:L152)-L155","v":0},2,0,0,0,3,0,0,2,3,0,3,2,1,0,0,3,3,3,3,0,0,3,0,0,0,0,0,0,0,0,0,0]
[null,null,null,null,null,null,null,null,null,"Total FA Cup Substitute Appearences ",{"$f":"COUNTIF(K146:K152,\">=12\")","v":1},{"$f":"COUNTIF(L146:L152,\">=12\")","v":0},1,0,0,0,0,0,0,0,0,0,0,1,0,0,0,0,0,0,0,0,0]
[null,null,null,null,null,null,null,null,null,"Goals",0,0,1,0,0,0,0,0,0,0,0,0,0,1,0,0,0,0,0,0,0,0,0,1,0,0,3,0,0,0,0,0,0,0]
[]
[null,null,null,null,null,null,null,"League Cup"]
[null,null,{"$f":"IF(J159=0,1,0)","v":0},{"$f":"D70","v":2},null,{"$f":"F70","v":"1974-09-02"},null,{"$f":"H70","v":"West Brom"},"(A)","L 0-1",null,null,10,null,null,null,9,null,null,2,4,null,null,11,3,null,8,1,5,null,6,7]
[null,null,1,{"$f":"D71","v":0},null,"00:00:00",null,"00:00:00","00:00:00",0]
[null,null,1,0,null,"00:00:00",null,"00:00:00","00:00:00",0]
[null,null,1,0,null,"00:00:00",null,"00:00:00","00:00:00",0]
[null,null,1,0,null,"00:00:00",null,"00:00:00","00:00:00",0]
[null,null,1,0,null,"00:00:00",null,"00:00:00","00:00:00",0]
[null,null,1,0,null,"00:00:00",null,"00:00:00","00:00:00",0]
[]
[null,null,null,null,null,null,null,null,null,"Total League Cup Apperances",{"$f":"COUNT(K159:K165)-K168","v":0},{"$f":"COUNT(L159:L165)-L168","v":0},1,0,0,0,1,0,0,1,1,0,0,1,1,0,1,1,1,0,1,1,0,0,0,0,0,0,0,0,0,0,0,0]
[null,null,null,null,null,null,null,null,null,"Total League Cup Substitute Appearences ",{"$f":"COUNTIF(K159:K165,\">=12\")","v":0},{"$f":"COUNTIF(L159:L165,\">=12\")","v":0},0,0,0,0,0,0,0,0,0,0,0,0,0,0,0,0,0,0,0,0,0,0,0,0,0,0,0,0,0,0,0,0]
[null,null,null,null,null,null,null,null,null,"Goals",0,0,0,0,0,0,0,0,0,0,0,0,0,0,0,0,0,0,0,0,0,0,0,0,0,0,0,0,0,0,0,0,0,0]
[null,null,1]
[null,null,1]
[null,null,1]
[null,null,1]
[null,null,1]
[null,null,1]
[null,null,1]
[null,null,1]
[]
[]
[]
[]
["Manual Input",null,null,null,null,null,null,"Opponents","Venue/Result",null,{"$f":"K3","v":"Allder"},{"$f":"L3","v":"Baldwin"},{"$f":"M3","v":"Bolland"},"B Brown","S Brown","Burnett","Clark","Cripps","Dillon","Donaldson","Dorney","Evans","Hazell","Hill","Jones","C Kelly","M Kelly","King","Kitchener","Moore","Saul","Smethurst","Smith","Summerill","Wood",0,0,0,0,0,0,0,0,0]
[null,null,{"$f":"IF(J183=0,1,0)","v":0},1,null,{"$f":"F5","v":"1974-08-17"},null,{"$f":"H5","v":"Sunderland"},"(H)","L 1-4",6,null,null,2,null,null,10,3,null,4,5,null,null,11,null,null,null,1,null,null,7,8,null,null,9]
[null,null,0,2,null,"1974-08-19",null,"Nottm Forest","(H)","W 3-0",null,null,null,3,12,null,9,null,null,2,4,null,null,11,null,null,10,1,5,null,6,7,null,null,8]
[null,null,0,3,null,"1974-08-24",null,"Man Utd","(A)","L 0-4",null,null,12,3,null,null,9,null,null,2,4,null,null,11,null,null,10,1,5,null,6,7,null,null,8]
[null,null,0,4,null,"1974-08-27",null,"Nottm Forest","(A)","L 1-2",null,null,9,3,null,null,null,null,null,2,4,null,null,11,null,null,10,1,5,null,6,7,null,null,8]
[null,null,0,5,null,"1974-08-31",null,"Fulham","(H)","W 2-0",null,null,10,null,null,null,null,null,null,2,4,null,null,11,3,null,8,1,5,null,6,7,null,null,9]
[null,null,0,6,null,"1974-09-07",null,"Blackpool","(A)","L 0-1",12,null,8,null,null,null,null,null,null,2,4,null,null,11,3,null,10,1,5,null,6,7,null,null,9]
[null,null,0,7,null,"1974-09-14",null,"Oxford","(H)","D 0-0",null,null,8,null,null,null,12,null,null,2,4,null,null,11,3,null,10,1,5,null,6,7,null,null,9]
[null,null,0,8,null,"1974-09-16",null,"Man Utd","(H)","L 0-1",10,null,7,null,null,null,8,null,null,2,4,null,null,11,3,null,null,1,5,null,6,null,null,null,9]
[null,null,0,9,null,"1974-09-21",null,"Aston Villa","(A)","L 0-3",6,null,10,null,null,null,12,null,null,2,4,null,null,11,3,null,null,1,5,null,7,8]
[null,null,0,10,null,"1974-09-24",null,"Hull City","(A)","D 1-1",10,null,7,2,null,null,null,null,null,4,6,null,null,11,3,null,null,1,5,null,8,9]
[null,null,0,11,null,"1974-09-28",null,"Bristol C","(H)","W 1-0",10,null,9,2,null,null,null,null,null,4,6,null,null,11,3,null,null,1,5,null,7,8]
[null,null,0,12,null,"1974-10-05",null,"Norwich","(A)","L 0-2",10,null,8,2,null,null,null,null,null,4,6,null,null,11,3,null,null,1,5,null,7,null,null,null,9]
[null,null,0,13,null,"1974-10-12",null,"Southampton","(H)","W 4-0",11,null,10,2,null,null,8,null,null,4,6,null,null,null,3,null,null,1,5,null,7,null,null,null,9]
[null,null,0,14,null,"1974-10-19",null,"Bristol R","(A)","L 0-2",11,null,7,2,null,null,10,null,null,4,6,null,null,12,3,null,null,1,5,null,8,null,null,null,9]
[null,null,0,15,null,"1974-10-26",null,"West Brom","(H)","D 2-2",6,null,10,null,12,null,8,null,null,2,4,null,null,11,3,null,null,1,5,null,7,null,null,null,9]
[null,null,0,16,null,"1974-11-02",null,"Oldham","(A)","D 1-1",7,null,10,null,12,null,8,null,null,2,4,null,null,11,3,null,null,1,5,null,6,null,null,null,9]
[null,null,0,17,null,"1974-11-09",null,{"$f":"H21","v":"Bolton"},"(H)","D 1-1",6,null,10,null,12,null,8,null,null,2,4,null,null,11,3,null,null,1,5,null,7,null,null,null,9]
[null,null,0,18,null,"1974-11-16",null,"York","(A)","L 1-2",6,null,10,null,9,null,8,null,null,2,4,null,null,11,3,null,null,1,5,null,7]
[null,null,0,19,null,"1974-11-30",null,"Notts Co","(A)","L 1-2",6,9,10,null,null,null,12,null,null,2,4,null,null,11,3,null,null,1,5,null,7,null,null,8]
[null,null,0,20,null,"1974-12-07",null,"Orient","(H)","D 1-1",10,9,7,null,null,null,null,null,5,2,4,null,null,11,3,null,null,1,null,null,6,null,null,8]
[null,null,0,21,null,"1974-12-14",null,"Sunderland","(A)","L 0-2",10,9,7,null,null,null,12,null,4,2,5,null,null,11,null,null,null,1,null,3,6,null,null,8]
[null,null,0,22,null,"1974-12-21",null,"Sheff Wed","(H)","W 2-1",10,9,7,null,null,null,null,null,11,null,4,null,2,null,null,null,null,1,5,3,6,null,null,8]
[null,null,0,23,null,"1974-12-26",null,"Oxford","(A)","L 1-3",null,9,null,null,null,null,null,null,10,2,4,null,7,11,null,null,null,1,5,3,6,null,null,8]
[null,null,0,24,null,"1974-12-28",null,"Portsmouth","(H)","D 0-0",12,9,null,null,null,null,10,null,null,4,6,null,2,11,null,null,null,1,5,3,7]
[null,null,0,25,null,"1975-01-11",null,"Orient","(A)","L 1-2",12,null,8,null,null,null,9,null,null,2,4,null,7,11,null,null,null,1,5,3,6,null,null,10]
[null,null,0,26,null,"1975-01-18",null,"Notts Co","(H)","W 3-0",8,null,6,null,null,null,9,null,null,null,4,null,7,11,12,null,null,1,5,3,null,null,2,10]
[null,null,0,27,null,"1975-01-25",null,"Cardiff","(H)","W 5-1",11,null,8,null,null,null,9,null,null,null,null,7,4,null,null,null,null,1,5,3,6,null,2,10]
[null,null,0,28,null,"1975-02-01",null,"Bolton","(A)","L 0-2",11,null,8,null,null,null,9,null,null,null,null,4,6,null,null,12,null,1,5,3,7,null,2,10]
[null,null,0,29,null,"1975-02-08",null,"Oldham","(H)","D 0-0",6,null,null,null,null,null,9,null,null,null,null,4,7,12,null,11,null,1,5,3,8,null,2,10]
[null,null,0,30,null,"1975-02-14",null,"Cardiff","(A)","W 1-0",null,null,null,null,null,null,12,null,null,null,7,4,8,11,null,9,null,1,5,3,6,null,2]
[null,null,0,31,null,"1975-02-22",null,"York","(H)","L 1-3",11,null,8,null,null,null,null,null,null,null,6,2,4,null,null,9,null,1,5,3,7,null,null,10]
[null,null,0,32,null,"1975-03-04",null,"Fulham","(A)","D 0-0",12,null,null,null,null,null,null,null,null,2,4,null,7,null,8,9,null,1,5,3,6,11,null,10]
[null,null,0,33,null,"1975-03-08",null,{"$f":"H37","v":"Hull City"},"(H)","W 2-0",null,null,null,null,null,null,9,null,null,2,6,null,4,null,11,null,null,1,5,3,7,8,null,10]
[null,null,0,34,null,"1975-03-15",null,"Bristol C","(A)","L 1-2",null,null,null,null,null,null,9,null,null,2,4,null,7,null,8,12,null,1,5,3,6,11,null,10]
[null,null,0,35,null,"1975-03-22",null,"Blackpool","(H)","D 0-0",11,null,null,null,null,6,8,null,null,null,null,2,4,null,null,9,null,1,5,3,7,null,null,10]
[null,null,0,36,null,"1975-03-29",null,"Sheff Wed","(A)","W 1-0",null,null,null,null,null,4,8,null,null,null,11,2,7,12,null,9,null,1,5,3,6,null,null,10]
[null,null,0,37,null,"1975-03-31",null,"Portsmouth","(A)","L 0-1",null,null,null,null,null,8,null,null,null,null,4,2,7,11,null,9,null,1,5,3,6,null,null,10]
[null,null,0,38,null,"1975-04-01",null,"Aston Villa","(H)","L 1-3",11,null,10,null,null,4,8,null,null,null,null,2,7,12,null,9,null,1,5,3,6]
[null,null,0,39,null,"1975-04-05",null,"West Brom","(A)","L 1-2",12,null,11,null,null,7,8,null,null,null,null,2,4,null,null,9,null,1,5,3,6]
[null,null,0,40,null,"1975-04-12",null,"Norwich","(H)","D 1-1",11,null,10,null,null,8,9,null,null,null,4,2,7,null,null,null,null,1,5,3,6]
[null,null,0,41,null,"1975-04-18",null,"Southampton","(A)","L 2-3",11,null,10,null,null,null,9,null,null,8,4,2,7,12,null,null,null,1,5,3,6]
[null,null,0,42,null,"1975-04-26",null,"Bristol R","(H)","D 1-1",10,null,null,null,null,null,9,null,null,8,4,2,7,11,null,null,null,1,5,3,6]
[null,null,1,43,null,"00:00:00",null,"00:00:00","00:00:00",0]
[null,null,1,44,null,"00:00:00",null,"00:00:00","00:00:00",0]
[null,null,{"$f":"IF(J227=0,1,0)","v":1},45,null,"00:00:00",null,"00:00:00","00:00:00",0]
[null,null,{"$f":"IF(J228=0,1,0)","v":1},46,null,"00:00:00",null,"00:00:00","00:00:00",0]
[]
[null,null,null,null,null,null,null,null,null,"Total League Apperances",{"$f":"COUNT(K183:K228)-K231","v":26},{"$f":"COUNT(L183:L228)-L231","v":6},28,9,1,6,25,1,4,29,36,13,21,26,19,9,6,42,39,22,41,13,5,17,14,0,0,0,0,0,0,0,0,0]
[null,null,null,null,null,null,null,null,null,"Total League Substitute Appearences ",{"$f":"COUNTIF(K183:K228,\">=12\")","v":5},0,{"$f":"COUNTIF(M183:M228,\">=12\")","v":1},{"$f":"COUNTIF(N183:N228,\">=12\")","v":0},4,0,5,0,0,0,0,0,0,5,1,2,0,0,0,0,0,0,0,0,0,0,0,0,0,0,0,0,0,0]
[null,null,null,null,null,null,null,null,null,"Goals",1,1,5,0,1,2,6,0,0,1,1,1,2,5,0,0,1,0,2,2,2,1,0,6,2,0,44,0,0,0,0,0,0,0]
[null,null,null,null,null,null,null,"FA Cup"]
[null,null,{"$f":"IF(J234=0,1,0)","v":0},{"$f":"D57","v":3},null,{"$f":"F57","v":"1975-01-04"},null,{"$f":"H57","v":"Bury"},"(A)","D 2-2",11,null,10,null,null,null,9,null,null,4,6,null,2,12,null,null,null,1,5,3,7,null,null,8]
[null,null,0,{"$f":"D58","v":"3R"},null,"1975-01-07",null,"Bury","(H)","D 1-1 *",12,null,8,null,null,null,9,null,null,2,4,null,7,11,null,null,null,1,5,3,6,null,null,10]
[null,null,0,"3R",null,"1975-01-13",null,"Bury","(N)","L 0-2",7,null,12,null,null,null,9,null,null,null,4,null,2,11,8,null,null,1,5,3,6,null,null,10]
[null,null,1,0,null,"00:00:00",null,"00:00:00","00:00:00",0]
[null,null,1,0,null,"00:00:00",null,"00:00:00","00:00:00",0]
[null,null,1,0,null,"00:00:00",null,"00:00:00","00:00:00",0]
[null,null,1,0,null,"00:00:00",null,"00:00:00","00:00:00",0]
[]
[null,null,null,null,null,null,null,null,null,"Total FA Cup Apperances",{"$f":"COUNT(K234:K240)-K243","v":2},{"$f":"COUNT(L234:L240)-L243","v":0},2,0,0,0,3,0,0,2,3,0,3,2,1,0,0,3,3,3,3,0,0,3,0,0,0,0,0,0,0,0,0,0]
[null,null,null,null,null,null,null,null,null,"Total FA Cup Substitute Appearences ",{"$f":"COUNTIF(K234:K240,\">=12\")","v":1},{"$f":"COUNTIF(L234:L240,\">=12\")","v":0},1,0,0,0,0,0,0,0,0,0,0,1,0,0,0,0,0,0,0,0,0,0,0,0,0,0,0,0,0,0,0,0]
[null,null,null,null,null,null,null,null,null,"Goals",0,0,1,0,0,0,0,0,0,0,0,0,0,1,0,0,0,0,0,0,0,0,0,1,0,0,3,0,0,0,0,0,0,0]
[]
[null,null,null,null,null,null,null,"League Cup"]
[null,null,{"$f":"IF(J247=0,1,0)","v":0},{"$f":"D70","v":2},null,{"$f":"F70","v":"1974-09-02"},null,{"$f":"H70","v":"West Brom"},{"$f":"I70","v":"(A)"},{"$f":"J70","v":"L 0-1"},null,null,10,null,null,null,9,null,null,2,4,null,null,11,3,null,8,1,5,null,6,7]
[null,null,1,{"$f":"D71","v":0},null,{"$f":"F71","v":"00:00:00"},null,{"$f":"H71","v":"00:00:00"},"00:00:00",0]
[null,null,1,0,null,"00:00:00",null,"00:00:00","00:00:00",0]
[null,null,1,0,null,"00:00:00",null,"00:00:00","00:00:00",0]
[null,null,1,0,null,"00:00:00",null,"00:00:00","00:00:00",0]
[null,null,1,0,null,"00:00:00",null,"00:00:00","00:00:00",0]
[null,null,1,0,null,"00:00:00",null,"00:00:00","00:00:00",0]
[]
[null,null,null,null,null,null,null,null,null,"Total League Cup Apperances",{"$f":"COUNT(K247:K253)-K256","v":0},{"$f":"COUNT(L247:L253)-L256","v":0},1,0,0,0,1,0,0,1,1,0,0,1,1,0,1,1,1,0,1,1,0,0,0,0,0,0,0,0,0,0,0,0]
[null,null,null,null,null,null,null,null,null,"Total League Cup Substitute Appearences ",{"$f":"COUNTIF(K247:K253,\">=12\")","v":0},{"$f":"COUNTIF(L247:L253,\">=12\")","v":0},0,0,0,0,0,0,0,0,0,0,0,0,0,0,0,0,0,0,0,0,0,0,0,0,0,0,0,0,0,0,0,0]
[null,null,null,null,null,null,null,null,null,"Goals",0,0,0,0,0,0,0,0,0,0,0,0,0,0,0,0,0,0,0,0,0,0,0,0,0,0,0,0,0,0,0,0,0,0]
[null,null,1]
[null,null,1]
[null,null,1]
[null,null,1]
[null,null,1]
[null,null,1]
[null,null,1]
[null,null,1]

{"sheet":"Sheet1","index":2,"n_rows":195,"n_cols":63,"rows_kept":195,"cut":false,"hidden":false,"merged":[[5,1,7,1],[5,52,7,52],[15,1,17,1],[15,52,17,52],[25,1,27,1],[25,52,27,52],[35,1,37,1],[35,52,37,52],[45,1,47,1],[45,52,47,52],[55,1,57,1],[55,52,57,52],[65,1,67,1],[65,52,67,52],[75,1,77,1],[75,52,77,52],[85,1,87,1],[85,52,87,52],[95,1,97,1],[95,52,97,52],[105,1,107,1],[105,52,107,52],[115,1,117,1],[115,52,117,52],[155,1,157,1],[155,52,157,52],[200,13,200,14],[201,13,201,14],[125,1,127,1],[125,52,127,52],[135,1,137,1],[135,52,137,52],[145,1,147,1],[145,52,147,52]]}
[]
[null,null,null,null,null,null,null,null,null,null,null,null,null,null,null,null,null,null,null,null,null,null,null,null,null,null,null,null,null,null,null,null,null,null,null,null,null,null,null,null,null,null,null,null,null,null,null,null,null,null,null,null,null,null,null,null,null,null,null,null,null,null,{"$f":"158-70","v":88}]
[]
[]
[]
[null,75,null,null,null,null,null,null,null,null,null,null,null,null,null,null,null,null,null,null,null,null,null,null,null,null,null,null,null,null,null,null,null,null,null,null,null,null,null,null,null,null,null,null,null,null,null,null,null,null,null,null,75]
[null,null,null,null,null,null,null,null,null,null,null,null,null,null,null,null,null,null,null,null,null,null,null,null,null,null,null,null,null,null,null,null,null,null,null,null,null,null,null,null,null,null,null,null,null,null,null,null,null,null,-5]
[]
[]
[]
[]
[null,null,null,null,null,null,null,null,null,null,null,null,null,null,null,null,null,null,null,null,null,null,null,null,null,null,null,null,null,null,null,null,null,null,null,null,null,null,null,null,null,null,null,null,null,null,null,null,null,null,-4]
[]
[]
[]
[null,70,null,null,null,null,null,null,null,null,null,null,null,null,null,null,null,null,null,null,null,null,null,null,null,null,null,null,null,null,null,null,null,null,null,null,null,null,null,null,null,null,null,null,null,null,null,null,null,null,null,null,70]
[null,null,null,null,null,null,null,null,null,null,null,null,null,null,null,null,null,null,null,null,null,null,null,null,null,null,null,null,null,null,null,null,null,null,null,null,null,null,null,null,null,null,null,null,null,null,null,null,null,null,-3]
[]
[]
[]
[]
[null,null,null,null,null,null,null,null,null,null,null,null,null,null,null,null,null,null,null,null,null,null,null,null,null,null,null,null,null,null,null,null,null,null,null,null,null,null,null,null,null,null,null,null,null,null,null,null,null,null,-2]
[]
[]
[]
[null,65,null,null,null,null,null,null,null,null,null,null,null,null,null,null,null,null,null,null,null,null,null,null,null,null,null,null,null,null,null,null,null,null,null,null,null,null,null,null,null,null,null,null,null,null,null,null,null,null,null,null,65]
[null,null,null,null,null,null,null,null,null,null,null,null,null,null,null,null,null,null,null,null,null,null,null,null,null,null,null,null,null,null,null,null,null,null,null,null,null,null,null,null,null,null,null,null,null,null,null,null,null,null,-1]
[]
[]
[]
[]
[null,null,null,null,null,null,null,null,null,null,null,null,null,null,null,null,null,null,null,null,null,null,null,null,null,null,null,null,null,null,null,null,null,null,null,null,null,null,null,null,null,null,null,null,null,null,null,null,null,null,0]
[]
[]
[]
[null,60,null,null,null,null,null,null,null,null,null,null,null,null,null,null,null,null,null,null,null,null,null,null,null,null,null,null,null,null,null,null,null,null,null,null,null,null,null,null,null,null,null,null,null,null,null,null,null,null,null,null,60]
[null,null,null,null,null,null,null,null,null,null,null,null,null,null,null,null,null,null,null,null,null,null,null,null,null,null,null,null,null,null,null,null,null,null,null,null,null,null,null,null,null,null,null,null,null,null,null,null,null,null,1]
[]
[]
[]
[]
[null,null,null,null,null,null,null,null,null,null,null,null,null,null,null,null,null,null,null,null,null,null,null,null,null,null,null,null,null,null,null,null,null,null,null,null,null,null,null,null,null,null,null,null,null,null,null,null,null,null,2]
[]
[]
[]
[null,55,null,null,null,null,null,null,null,null,null,null,null,null,null,null,null,null,null,null,null,null,null,null,null,null,null,null,null,null,null,null,null,null,null,null,null,null,null,null,null,null,null,null,null,null,null,null,null,null,null,null,55]
[null,null,null,null,null,null,null,null,null,null,null,null,null,null,null,null,null,null,null,null,null,null,null,null,null,null,null,null,null,null,null,null,null,null,null,null,null,null,null,null,null,null,null,null,null,null,null,null,null,null,3]
[]
[]
[]
[]
[null,null,null,null,null,null,null,null,null,null,null,null,null,null,null,null,null,null,null,null,null,null,null,null,null,null,null,null,null,null,null,null,null,null,null,null,null,null,null,null,null,null,null,null,null,null,null,null,null,null,4]
[]
[]
[]
[null,50,null,null,null,null,null,null,null,null,null,null,null,null,null,null,null,null,null,null,null,null,null,null,null,null,null,null,null,null,null,null,null,null,null,null,null,null,null,null,null,null,null,null,null,null,null,null,null,null,null,null,50]
[null,null,null,null,null,null,null,null,null,null,null,null,null,null,null,null,null,null,null,null,null,null,null,null,null,null,null,null,null,null,null,null,null,null,null,null,null,null,null,null,null,null,null,null,null,null,null,null,null,null,5]
[]
[]
[]
[]
[null,null,null,null,null,null,null,null,null,null,null,null,null,null,null,null,null,null,null,null,null,null,null,null,null,null,null,null,null,null,null,null,null,null,null,null,null,null,null,null,null,null,null,null,null,null,null,null,null,null,6]
[]
[]
[]
[null,45,null,null,null,null,null,null,null,null,null,null,null,null,null,null,null,null,null,null,null,null,null,null,null,null,null,null,null,null,null,null,null,null,null,null,null,null,null,null,null,null,null,null,null,null,null,null,null,null,null,null,45]
[null,null,null,null,null,null,null,null,null,null,null,null,null,null,null,null,null,null,null,null,null,null,null,null,null,null,null,null,null,null,null,null,null,null,null,null,null,null,null,null,null,null,null,null,null,null,null,null,null,null,7]
[]
[]
[]
[]
[null,null,null,null,null,null,null,null,null,null,null,null,null,null,null,null,null,null,null,null,null,null,null,null,null,null,null,null,null,null,null,null,null,null,null,null,null,null,null,null,null,null,null,null,null,null,null,null,null,null,8]
[]
[]
[]
[null,40,null,null,null,null,null,null,null,null,null,null,null,null,null,null,null,null,null,null,null,null,null,null,null,null,null,null,null,null,null,null,null,null,null,null,null,null,null,null,null,null,null,null,null,null,null,null,null,null,null,null,40]
[null,null,null,null,null,null,null,null,null,null,null,null,null,null,null,null,null,null,null,null,null,null,null,null,null,null,null,null,null,null,null,null,null,null,null,null,null,null,null,null,null,null,null,null,null,null,null,null,null,null,9]
[]
[]
[]
[]
[null,null,null,null,null,null,null,null,null,null,null,null,null,null,null,null,null,null,null,null,null,null,null,null,null,null,null,null,null,null,null,null,null,null,null,null,null,null,null,null,null,null,null,null,null,null,null,null,null,null,10]
[]
[]
[]
[null,35,null,null,null,null,null,null,null,null,null,null,null,null,null,null,null,null,null,null,null,null,null,null,null,null,null,null,null,null,null,null,null,null,null,null,null,null,null,null,null,null,null,null,null,null,null,null,null,null,null,null,35]
[null,null,null,null,null,null,null,null,null,null,null,null,null,null,null,null,null,null,null,null,null,null,null,null,null,null,null,null,null,null,null,null,null,null,null,null,null,null,null,null,null,null,null,null,null,null,null,null,null,null,11]
[]
[]
[]
[]
[null,null,null,null,null,null,null,null,null,null,null,null,null,null,null,null,null,null,null,null,null,null,null,null,null,null,null,null,null,null,null,null,null,null,null,null,null,null,null,null,null,null,null,null,null,null,null,null,null,null,12]
[]
[]
[]
[null,30,null,null,null,null,null,null,null,null,null,null,null,null,null,null,null,null,null,null,null,null,null,null,null,null,null,null,null,null,null,null,null,null,null,null,null,null,null,null,null,null,null,null,null,null,null,null,null,null,null,null,30]
[null,null,null,null,null,null,null,null,null,null,null,null,null,null,null,null,null,null,null,null,null,null,null,null,null,null,null,null,null,null,null,null,null,null,null,null,null,null,null,null,null,null,null,null,null,null,null,null,null,null,13]
[]
[]
[]
[]
[null,null,null,null,null,null,null,null,null,null,null,null,null,null,null,null,null,null,null,null,null,null,null,null,null,null,null,null,null,null,null,null,null,null,null,null,null,null,null,null,null,null,null,null,null,null,null,null,null,null,14]
[]
[]
[]
[null,25,null,null,null,null,null,null,null,null,null,null,null,null,null,null,null,null,null,null,null,null,null,null,null,null,null,null,null,null,null,null,null,null,null,null,null,null,null,null,null,null,null,null,null,null,null,null,null,null,null,null,25]
[null,null,null,null,null,null,null,null,null,null,null,null,null,null,null,null,null,null,null,null,null,null,null,null,null,null,null,null,null,null,null,null,null,null,null,null,null,null,null,null,null,null,null,null,null,null,null,null,null,null,15]
[]
[]
[]
[]
[null,null,null,null,null,null,null,null,null,null,null,null,null,null,null,null,null,null,null,null,null,null,null,null,null,null,null,null,null,null,null,null,null,null,null,null,null,null,null,null,null,null,null,null,null,null,null,null,null,null,16]
[]
[]
[]
[null,20,null,null,null,null,null,null,null,null,null,null,null,null,null,null,null,null,null,null,null,null,null,null,null,null,null,null,null,null,null,null,null,null,null,null,null,null,null,null,null,null,null,null,null,null,null,null,null,null,null,null,20]
[null,null,null,null,null,null,null,null,null,null,null,null,null,null,null,null,null,null,null,null,null,null,null,null,null,null,null,null,null,null,null,null,null,null,null,null,null,null,null,null,null,null,null,null,null,null,null,null,null,null,17]
[]
[]
[]
[]
[null,null,null,null,null,null,null,null,null,null,null,null,null,null,null,null,null,null,null,null,null,null,null,null,null,null,null,null,null,null,null,null,null,null,null,null,null,null,null,null,null,null,null,null,null,null,null,null,null,null,18]
[]
[]
[]
[null,15,null,null,null,null,null,null,null,null,null,null,null,null,null,null,null,null,null,null,null,null,null,null,null,null,null,null,null,null,null,null,null,null,null,null,null,null,null,null,null,null,null,null,null,null,null,null,null,null,null,null,15]
[null,null,null,null,null,null,null,null,null,null,null,null,null,null,null,null,null,null,null,null,null,null,null,null,null,null,null,null,null,null,null,null,null,null,null,null,null,null,null,null,null,null,null,null,null,null,null,null,null,null,19]
[]
[]
[]
[]
[null,null,null,null,null,null,null,null,null,null,null,null,null,null,null,null,null,null,null,null,null,null,null,null,null,null,null,null,null,null,null,null,null,null,null,null,null,null,null,null,null,null,null,null,null,null,null,null,null,null,20]
[]
[]
[]
[null,10,null,null,null,null,null,null,null,null,null,null,null,null,null,null,null,null,null,null,null,null,null,null,null,null,null,null,null,null,null,null,null,null,null,null,null,null,null,null,null,null,null,null,null,null,null,null,null,null,null,null,10]
[null,null,null,null,null,null,null,null,null,null,null,null,null,null,null,null,null,null,null,null,null,null,null,null,null,null,null,null,null,null,null,null,null,null,null,null,null,null,null,null,null,null,null,null,null,null,null,null,null,null,21]
[]
[]
[]
[]
[null,null,null,null,null,null,null,null,null,null,null,null,null,null,null,null,null,null,null,null,null,null,null,null,null,null,null,null,null,null,null,null,null,null,null,null,null,null,null,null,null,null,null,null,null,null,null,null,null,null,22]
[]
[]
[]
[null,5,null,null,null,null,null,null,null,null,null,null,null,null,null,null,null,null,null,null,null,null,null,null,null,null,null,null,null,null,null,null,null,null,null,null,null,null,null,null,null,null,null,null,null,null,null,null,null,null,null,null,5]
[]
[]
[]
[]
[]
[]
[]
[]
[]
[null,0,null,null,null,null,null,null,null,null,null,null,null,null,null,null,null,null,null,null,null,null,null,null,null,null,null,null,null,null,null,null,null,null,null,null,null,null,null,null,null,null,null,null,null,null,null,null,null,null,null,null,0]
[]
[]
[]
[null,null,null,null,"Sunderland (H) L 1-4","Nottm Forest (H) W 3-0","Man Utd (A) L 0-4","Nottm Forest (A) L 1-2","Fulham (H) W 2-0","Blackpool (A) L 0-1","Oxford (H) D 0-0","Man Utd (H) L 0-1","Aston Villa (A) L 0-3","Hull City (A) D 1-1","Bristol C (H) W 1-0","Norwich (A) L 0-2","Southampton (H) W 4-0","Bristol R (A) L 0-2","West Brom (H) D 2-2","Oldham (A) D 1-1","Bolton (H) D 1-1","York (A) L 1-2","Notts Co (A) L 1-2","Orient (H) D 1-1","Sunderland (A) L 0-2","Sheff Wed (H) W 2-1","Oxford (A) L 1-3","Portsmouth (H) D 0-0","Orient (A) L 1-2","Notts Co (H) W 3-0","Cardiff (H) W 5-1","Bolton (A) L 0-2","Oldham (H) D 0-0","Cardiff (A) W 1-0","York (H) L 1-3","Fulham (A) D 0-0","Hull City (H) W 2-0","Bristol C (A) L 1-2","Blackpool (H) D 0-0","Sheff Wed (A) W 1-0","Portsmouth (A) L 0-1","Aston Villa (H) L 1-3","West Brom (A) L 1-2","Norwich (H) D 1-1","Southampton (A) L 2-3","Bristol R (H) D 1-1","Final Table",null,{"$f":"Sheet1!AW142","v":0}]
[]
[]
[]
[]
[]
[]
[null,null,null,null,{"$f":"E187-E174","v":0},0,0,0,2,0,0,0,1,0,1,1,0,2,0,0,1,3,2,1,1,1,2,2,2,1,1,1,2,2,1,1,1,2,0,0,0,2,0,0,0,2,0]
[null,null,null,null,5,6,7,8,9,10,11,12,13,14,15,16,17,18,19,20,21,22,23,24,25,26,27,28,29,30,31,32,33,34,35,36,37,38,39,40,41,42,43,44,45,46,47]
[null,null,null,null,{"$f":"E176-E189","v":0},{"$f":"F176-F189","v":0},0,1,0,0,0,0,0,0,1,0,0,0,1,1,2,0,0,0,0,0,1,0,2,2,1,1,1,0,2,1,1,0,1,0,0,1,2,1,1,3,0]
[]
[]
[null,"Top Y",null,null,{"$f":"Sheet2!$I$6","v":2},{"$f":"Sheet2!$I$7","v":2},{"$f":"Sheet2!$I$8","v":5},{"$f":"Sheet2!$I$9","v":6},{"$f":"Sheet2!$I$10","v":8},{"$f":"Sheet2!$I$11","v":9},{"$f":"Sheet2!$I$12","v":10},{"$f":"Sheet2!$I$13","v":12},{"$f":"Sheet2!$I$14","v":14},{"$f":"Sheet2!$I$15","v":14},{"$f":"Sheet2!$I$16","v":16},{"$f":"Sheet2!$I$17","v":18},{"$f":"Sheet2!$I$18","v":20},{"$f":"Sheet2!$I$19","v":23},{"$f":"Sheet2!$I$20","v":25},{"$f":"Sheet2!$I$21","v":27},{"$f":"Sheet2!$I$22","v":27},{"$f":"Sheet2!$I$23","v":29},{"$f":"Sheet2!$I$24","v":31},{"$f":"Sheet2!$I$25","v":32},{"$f":"Sheet2!$I$26","v":33},{"$f":"Sheet2!$I$27","v":35},{"$f":"Sheet2!$I$28","v":37},{"$f":"Sheet2!$I$29","v":37},{"$f":"Sheet2!$I$30","v":39},{"$f":"Sheet2!$I$31","v":40},{"$f":"Sheet2!$I$32","v":40},{"$f":"Sheet2!$I$33","v":40},{"$f":"Sheet2!$I$34","v":40},{"$f":"Sheet2!$I$35","v":40},{"$f":"Sheet2!$I$36","v":42},{"$f":"Sheet2!$I$37","v":44},{"$f":"Sheet2!$I$38","v":46},{"$f":"Sheet2!$I$39","v":47},{"$f":"Sheet2!$I$40","v":49},{"$f":"Sheet2!$I$41","v":52},{"$f":"Sheet2!$I$42","v":54},{"$f":"Sheet2!$I$43","v":54},{"$f":"Sheet2!$I$44","v":56},{"$f":"Sheet2!$I$45","v":58},{"$f":"Sheet2!$I$46","v":58},{"$f":"Sheet2!$I$47","v":61},{"$f":"Sheet2!$I$48","v":0},{"$f":"Sheet2!$I$49","v":0},{"$f":"Sheet2!$I$50","v":0},{"$f":"Sheet2!$I$51","v":0},{"$f":"Sheet2!$I$52","v":0}]
[]
[null,"4th a",null,null,{"$f":"Sheet2!$K$6","v":2},{"$f":"Sheet2!$K$7","v":2},{"$f":"Sheet2!$K$8","v":4},{"$f":"Sheet2!$K$9","v":4},{"$f":"Sheet2!$K$10","v":5},{"$f":"Sheet2!$K$11","v":7},{"$f":"Sheet2!$K$12","v":8},{"$f":"Sheet2!$K$13","v":8},{"$f":"Sheet2!$K$14","v":9},{"$f":"Sheet2!$K$15","v":10},{"$f":"Sheet2!$K$16","v":11},{"$f":"Sheet2!$K$17","v":14},{"$f":"Sheet2!$K$18","v":16},{"$f":"Sheet2!$K$19","v":17},{"$f":"Sheet2!$K$20","v":19},{"$f":"Sheet2!$K$21","v":19},{"$f":"Sheet2!$K$22","v":20},{"$f":"Sheet2!$K$23","v":20},{"$f":"Sheet2!$K$24","v":23},{"$f":"Sheet2!$K$25","v":25},{"$f":"Sheet2!$K$26","v":25},{"$f":"Sheet2!$K$27","v":27},{"$f":"Sheet2!$K$28","v":27},{"$f":"Sheet2!$K$29","v":29},{"$f":"Sheet2!$K$30","v":29},{"$f":"Sheet2!$K$31","v":30},{"$f":"Sheet2!$K$32","v":30},{"$f":"Sheet2!$K$33","v":32},{"$f":"Sheet2!$K$34","v":33},{"$f":"Sheet2!$K$35","v":33},{"$f":"Sheet2!$K$36","v":37},{"$f":"Sheet2!$K$37","v":37},{"$f":"Sheet2!$K$38","v":39},{"$f":"Sheet2!$K$39","v":40},{"$f":"Sheet2!$K$40","v":42},{"$f":"Sheet2!$K$41","v":44},{"$f":"Sheet2!$K$42","v":44},{"$f":"Sheet2!$K$43","v":44},{"$f":"Sheet2!$K$44","v":46},{"$f":"Sheet2!$K$45","v":49},{"$f":"Sheet2!$K$46","v":49},{"$f":"Sheet2!$K$47","v":51},{"$f":"Sheet2!$K$48","v":0},{"$f":"Sheet2!$K$49","v":0},{"$f":"Sheet2!$K$50","v":0},{"$f":"Sheet2!$K$51","v":0},{"$f":"Sheet2!$K$52","v":0}]
[]
[null,"19th b",null,null,{"$f":"Sheet2!$M$6","v":0},{"$f":"Sheet2!$M$7","v":0},{"$f":"Sheet2!$M$8","v":1},{"$f":"Sheet2!$M$9","v":2},{"$f":"Sheet2!$M$10","v":2},{"$f":"Sheet2!$M$11","v":3},{"$f":"Sheet2!$M$12","v":4},{"$f":"Sheet2!$M$13","v":4},{"$f":"Sheet2!$M$14","v":5},{"$f":"Sheet2!$M$15","v":5},{"$f":"Sheet2!$M$16","v":7},{"$f":"Sheet2!$M$17","v":8},{"$f":"Sheet2!$M$18","v":8},{"$f":"Sheet2!$M$19","v":10},{"$f":"Sheet2!$M$20","v":11},{"$f":"Sheet2!$M$21","v":12},{"$f":"Sheet2!$M$22","v":13},{"$f":"Sheet2!$M$23","v":13},{"$f":"Sheet2!$M$24","v":14},{"$f":"Sheet2!$M$25","v":15},{"$f":"Sheet2!$M$26","v":16},{"$f":"Sheet2!$M$27","v":17},{"$f":"Sheet2!$M$28","v":18},{"$f":"Sheet2!$M$29","v":19},{"$f":"Sheet2!$M$30","v":21},{"$f":"Sheet2!$M$31","v":22},{"$f":"Sheet2!$M$32","v":22},{"$f":"Sheet2!$M$33","v":23},{"$f":"Sheet2!$M$34","v":24},{"$f":"Sheet2!$M$35","v":24},{"$f":"Sheet2!$M$36","v":26},{"$f":"Sheet2!$M$37","v":26},{"$f":"Sheet2!$M$38","v":27},{"$f":"Sheet2!$M$39","v":27},{"$f":"Sheet2!$M$40","v":29},{"$f":"Sheet2!$M$41","v":30},{"$f":"Sheet2!$M$42","v":30},{"$f":"Sheet2!$M$43","v":31},{"$f":"Sheet2!$M$44","v":33},{"$f":"Sheet2!$M$45","v":33},{"$f":"Sheet2!$M$46","v":33},{"$f":"Sheet2!$M$47","v":35},{"$f":"Sheet2!$M$48","v":0},{"$f":"Sheet2!$M$49","v":0},{"$f":"Sheet2!$M$50","v":0},{"$f":"Sheet2!$M$51","v":0},{"$f":"Sheet2!$M$52","v":0}]
[]
[null,"22nd c",null,null,{"$f":"Sheet2!$O$6","v":0},{"$f":"Sheet2!$O$7","v":0},{"$f":"Sheet2!$O$8","v":0},{"$f":"Sheet2!$O$9","v":0},{"$f":"Sheet2!$O$10","v":1},{"$f":"Sheet2!$O$11","v":2},{"$f":"Sheet2!$O$12","v":3},{"$f":"Sheet2!$O$13","v":3},{"$f":"Sheet2!$O$14","v":4},{"$f":"Sheet2!$O$15","v":4},{"$f":"Sheet2!$O$16","v":4},{"$f":"Sheet2!$O$17","v":4},{"$f":"Sheet2!$O$18","v":4},{"$f":"Sheet2!$O$19","v":6},{"$f":"Sheet2!$O$20","v":8},{"$f":"Sheet2!$O$21","v":9},{"$f":"Sheet2!$O$22","v":11},{"$f":"Sheet2!$O$23","v":12},{"$f":"Sheet2!$O$24","v":13},{"$f":"Sheet2!$O$25","v":14},{"$f":"Sheet2!$O$26","v":14},{"$f":"Sheet2!$O$27","v":16},{"$f":"Sheet2!$O$28","v":16},{"$f":"Sheet2!$O$29","v":17},{"$f":"Sheet2!$O$30","v":17},{"$f":"Sheet2!$O$31","v":18},{"$f":"Sheet2!$O$32","v":18},{"$f":"Sheet2!$O$33","v":18},{"$f":"Sheet2!$O$34","v":19},{"$f":"Sheet2!$O$35","v":19},{"$f":"Sheet2!$O$36","v":19},{"$f":"Sheet2!$O$37","v":19},{"$f":"Sheet2!$O$38","v":19},{"$f":"Sheet2!$O$39","v":19},{"$f":"Sheet2!$O$40","v":20},{"$f":"Sheet2!$O$41","v":20},{"$f":"Sheet2!$O$42","v":20},{"$f":"Sheet2!$O$43","v":20},{"$f":"Sheet2!$O$44","v":20},{"$f":"Sheet2!$O$45","v":20},{"$f":"Sheet2!$O$46","v":20},{"$f":"Sheet2!$O$47","v":21},{"$f":"Sheet2!$O$48","v":0},{"$f":"Sheet2!$O$49","v":0},{"$f":"Sheet2!$O$50","v":0},{"$f":"Sheet2!$O$51","v":0},{"$f":"Sheet2!$O$52","v":0}]
[]
[null,"d"]
[]
[null,"Millwall e",null,null,{"$f":"Sheet2!$G$6","v":0},{"$f":"Sheet2!$G$7","v":2},{"$f":"Sheet2!$G$8","v":2},{"$f":"Sheet2!$G$9","v":2},{"$f":"Sheet2!$G$10","v":4},{"$f":"Sheet2!$G$11","v":4},{"$f":"Sheet2!$G$12","v":5},{"$f":"Sheet2!$G$13","v":5},{"$f":"Sheet2!$G$14","v":5},{"$f":"Sheet2!$G$15","v":6},{"$f":"Sheet2!$G$16","v":8},{"$f":"Sheet2!$G$17","v":8},{"$f":"Sheet2!$G$18","v":10},{"$f":"Sheet2!$G$19","v":10},{"$f":"Sheet2!$G$20","v":11},{"$f":"Sheet2!$G$21","v":12},{"$f":"Sheet2!$G$22","v":13},{"$f":"Sheet2!$G$23","v":13},{"$f":"Sheet2!$G$24","v":13},{"$f":"Sheet2!$G$25","v":14},{"$f":"Sheet2!$G$26","v":14},{"$f":"Sheet2!$G$27","v":16},{"$f":"Sheet2!$G$28","v":16},{"$f":"Sheet2!$G$29","v":17},{"$f":"Sheet2!$G$30","v":17},{"$f":"Sheet2!$G$31","v":19},{"$f":"Sheet2!$G$32","v":21},{"$f":"Sheet2!$G$33","v":21},{"$f":"Sheet2!$G$34","v":22},{"$f":"Sheet2!$G$35","v":24},{"$f":"Sheet2!$G$36","v":24},{"$f":"Sheet2!$G$37","v":25},{"$f":"Sheet2!$G$38","v":27},{"$f":"Sheet2!$G$39","v":27},{"$f":"Sheet2!$G$40","v":28},{"$f":"Sheet2!$G$41","v":30},{"$f":"Sheet2!$G$42","v":30},{"$f":"Sheet2!$G$43","v":30},{"$f":"Sheet2!$G$44","v":30},{"$f":"Sheet2!$G$45","v":31},{"$f":"Sheet2!$G$46","v":31},{"$f":"Sheet2!$G$47","v":32},{"$f":"Sheet2!$G$48","v":0},{"$f":"Sheet2!$G$49","v":0},{"$f":"Sheet2!$G$50","v":0},{"$f":"Sheet2!$G$51","v":0},{"$f":"Sheet2!$G$52","v":0}]
[]
[]
[]
[]
[null,"3rd f",null,null,{"$f":"(Sheet2!$T$6)","v":2},{"$f":"(Sheet2!$T$7)","v":2},{"$f":"(Sheet2!$T$8)","v":4},{"$f":"(Sheet2!$T$9)","v":4},{"$f":"(Sheet2!$T$10)","v":7},{"$f":"(Sheet2!$T$11)","v":7},{"$f":"(Sheet2!$T$12)","v":8},{"$f":"(Sheet2!$T$13)","v":8},{"$f":"(Sheet2!$T$14)","v":10},{"$f":"(Sheet2!$T$15)","v":10},{"$f":"(Sheet2!$T$16)","v":12},{"$f":"(Sheet2!$T$17)","v":15},{"$f":"(Sheet2!$T$18)","v":16},{"$f":"(Sheet2!$T$19)","v":19},{"$f":"(Sheet2!$T$20)","v":19},{"$f":"(Sheet2!$T$21)","v":19},{"$f":"(Sheet2!$T$22)","v":21},{"$f":"(Sheet2!$T$23)","v":23},{"$f":"(Sheet2!$T$24)","v":25},{"$f":"(Sheet2!$T$25)","v":26},{"$f":"(Sheet2!$T$26)","v":26},{"$f":"(Sheet2!$T$27)","v":28},{"$f":"(Sheet2!$T$28)","v":29},{"$f":"(Sheet2!$T$29)","v":31},{"$f":"(Sheet2!$T$30)","v":31},{"$f":"(Sheet2!$T$31)","v":31},{"$f":"(Sheet2!$T$32)","v":31},{"$f":"(Sheet2!$T$33)","v":33},{"$f":"(Sheet2!$T$34)","v":35},{"$f":"(Sheet2!$T$35)","v":35},{"$f":"(Sheet2!$T$36)","v":38},{"$f":"(Sheet2!$T$37)","v":38},{"$f":"(Sheet2!$T$38)","v":40},{"$f":"(Sheet2!$T$39)","v":42},{"$f":"(Sheet2!$T$40)","v":42},{"$f":"(Sheet2!$T$41)","v":44},{"$f":"(Sheet2!$T$42)","v":44},{"$f":"(Sheet2!$T$43)","v":46},{"$f":"(Sheet2!$T$44)","v":46},{"$f":"(Sheet2!$T$45)","v":49},{"$f":"(Sheet2!$T$46)","v":49},{"$f":"(Sheet2!$T$47)","v":53},{"$f":"(Sheet2!$T$48)","v":0},{"$f":"(Sheet2!$T$49)","v":0},{"$f":"(Sheet2!$T$50)","v":0},{"$f":"(Sheet2!$T$51)","v":0},{"$f":"(Sheet2!$T$52)","v":0}]
[]
[null,"20th g",null,null,{"$f":"(Sheet2!$V$6)","v":0},{"$f":"(Sheet2!$V$7)","v":0},{"$f":"(Sheet2!$V$8)","v":1},{"$f":"(Sheet2!$V$9)","v":1},{"$f":"(Sheet2!$V$10)","v":2},{"$f":"(Sheet2!$V$11)","v":3},{"$f":"(Sheet2!$V$12)","v":4},{"$f":"(Sheet2!$V$13)","v":4},{"$f":"(Sheet2!$V$14)","v":5},{"$f":"(Sheet2!$V$15)","v":5},{"$f":"(Sheet2!$V$16)","v":6},{"$f":"(Sheet2!$V$17)","v":8},{"$f":"(Sheet2!$V$18)","v":8},{"$f":"(Sheet2!$V$19)","v":10},{"$f":"(Sheet2!$V$20)","v":10},{"$f":"(Sheet2!$V$21)","v":11},{"$f":"(Sheet2!$V$22)","v":11},{"$f":"(Sheet2!$V$23)","v":13},{"$f":"(Sheet2!$V$24)","v":14},{"$f":"(Sheet2!$V$25)","v":15},{"$f":"(Sheet2!$V$26)","v":16},{"$f":"(Sheet2!$V$27)","v":17},{"$f":"(Sheet2!$V$28)","v":17},{"$f":"(Sheet2!$V$29)","v":19},{"$f":"(Sheet2!$V$30)","v":19},{"$f":"(Sheet2!$V$31)","v":20},{"$f":"(Sheet2!$V$32)","v":21},{"$f":"(Sheet2!$V$33)","v":22},{"$f":"(Sheet2!$V$34)","v":23},{"$f":"(Sheet2!$V$35)","v":24},{"$f":"(Sheet2!$V$36)","v":24},{"$f":"(Sheet2!$V$37)","v":25},{"$f":"(Sheet2!$V$38)","v":26},{"$f":"(Sheet2!$V$39)","v":27},{"$f":"(Sheet2!$V$40)","v":28},{"$f":"(Sheet2!$V$41)","v":30},{"$f":"(Sheet2!$V$42)","v":30},{"$f":"(Sheet2!$V$43)","v":30},{"$f":"(Sheet2!$V$44)","v":31},{"$f":"(Sheet2!$V$45)","v":32},{"$f":"(Sheet2!$V$46)","v":32},{"$f":"(Sheet2!$V$47)","v":32},{"$f":"(Sheet2!$V$48)","v":0},{"$f":"(Sheet2!$V$49)","v":0},{"$f":"(Sheet2!$V$50)","v":0},{"$f":"(Sheet2!$V$51)","v":0},{"$f":"(Sheet2!$V$52)","v":0}]
[]
[]
[]
[]
[null,null,null,null,5,6,7,8,9,10,11,12,13,14,15,16,17,18,19,20,21,22,23,24,25,26,27,28,29,30,31,32,33,34,35,36,37,38,39,40,41,42,43,44,45,46,47,48,45,46,47]
[null,null,null,null,{"$f":"E176-E189","v":0},{"$f":"F176-F189","v":0},0,1,0,0,0,0,0,0,1,0,0,0,1,1,2,0,0,0,0,0,1,0,2,2,1,1,1,0,2,1,1,0,1,0,0,1,2,1,1,3,0,0,0,0,0]

{"sheet":"Sheet2","index":3,"n_rows":47,"n_cols":26,"rows_kept":47,"cut":false,"hidden":false,"merged":[]}
[null,null,"Millwall 1974/75 results and fixtures ",null,null,null,{"$f":"[4]Summary!$AP$65","v":32},{"$f":"[4]Summary!$Q$22","v":20},{"$f":"[4]Summary!$AP$10","v":61},1,{"$f":"[4]Summary!$AP$13","v":51},4,{"$f":"[4]Summary!$AP$28","v":35},19,{"$f":"[4]Summary!$AP$31","v":21},22,null,null,{"$f":"[4]Summary!$T$5","v":84},{"$f":"[4]Summary!$AP$12","v":53},3,{"$f":"[4]Summary!$AP$29","v":32},20,null,null,{"$f":"[4]Summary!$U$7","v":"Bristol R D 1-1"}]
[]
[]
[null,null,null,null,null,null,"x"]
[null,"Game","Competition",null,"Pts","Pos","Millwall","Pos","top","Pos","4th","Pos","19th","Pos","Bottom","Pos","Bottom","Pos","Day","3rd","Pos","21st","Pos",null,null,"Vesus"]
[null,1,"Division 2","Sunderland (H) L 1-4",null,null,0,19,2,1,2,4,0,19,0,22,null,null,1,2,3,0,20,null,null,"Sunderland L 1-4"]
[null,2,"Division 2","Nottm Forest (H) W 3-0",null,null,2,7,2,1,2,4,0,19,0,22,null,null,2,2,3,0,20,null,null,"Nottm Forest W 3-0"]
[null,3,"Division 2","Man Utd (A) L 0-4",null,null,2,13,5,1,4,4,1,19,0,22,null,null,5,4,3,1,20,null,null,"Man Utd L 0-4"]
[null,4,"Division 2","Nottm Forest (A) L 1-2",null,null,2,18,6,1,4,4,2,19,0,22,null,null,6,4,3,1,20,null,null,"Nottm Forest L 1-2"]
[null,5,"Division 2","Fulham (H) W 2-0",null,null,4,12,8,1,5,4,2,19,1,22,null,null,8,7,3,2,20,null,null,"Fulham W 2-0"]
[null,6,"Division 2","Blackpool (A) L 0-1",null,null,4,15,9,1,7,4,3,19,2,22,null,null,9,7,3,3,20,null,null,"Blackpool L 0-1"]
[null,7,"Division 2","Oxford (H) D 0-0",null,null,5,16,10,1,8,4,4,19,3,22,null,null,10,8,3,4,20,null,null,"Oxford D 0-0"]
[null,8,"Division 2","Man Utd (H) L 0-1",null,null,5,18,12,1,8,4,4,19,3,22,null,null,11,8,3,4,20,null,null,"Oxford D 0-0"]
[null,9,"Division 2","Aston Villa (A) L 0-3",null,null,5,21,14,1,9,4,5,19,4,22,null,null,14,10,3,5,20,null,null,"Aston Villa L 0-3"]
[null,10,"Division 2","Hull City (A) D 1-1",null,null,6,18,14,1,10,4,5,19,4,22,null,null,15,10,3,5,20,null,null,"Aston Villa L 0-3"]
[null,11,"Division 2","Bristol C (H) W 1-0",null,null,8,18,16,1,11,4,7,19,4,22,null,null,17,12,3,6,20,null,null,"Hull City D 1-1"]
[null,12,"Division 2","Norwich (A) L 0-2",null,null,8,20,18,1,14,4,8,19,4,22,null,null,19,15,3,8,20,null,null,"Norwich L 0-2"]
[null,13,"Division 2","Southampton (H) W 4-0",null,null,10,16,20,1,16,4,8,19,4,22,null,null,20,16,3,8,20,null,null,"Southampton W 4-0"]
[null,14,"Division 2","Bristol R (A) L 0-2",null,null,10,19,23,1,17,4,10,19,6,22,null,null,23,19,3,10,20,null,null,"Bristol R L 0-2"]
[null,15,"Division 2","West Brom (H) D 2-2",null,null,11,18,25,1,19,4,11,19,8,22,null,null,26,19,3,10,20,null,null,"West Brom D 2-2"]
[null,16,"Division 2","Oldham (A) D 1-1",null,null,12,19,27,1,19,4,12,19,9,22,null,null,28,19,3,11,20,null,null,"Oldham D 1-1"]
[null,17,"Division 2","Bolton (H) D 1-1",null,null,13,19,27,1,20,4,13,19,11,22,null,null,31,21,3,11,20,null,null,"Bolton D 1-1"]
[null,18,"Division 2","York (A) L 1-2",null,null,13,19,29,1,20,4,13,19,12,22,null,null,33,23,3,13,20,null,null,"York L 1-2"]
[null,19,"Division 2","Notts Co (A) L 1-2",null,null,13,20,31,1,23,4,14,19,13,22,null,null,36,25,3,14,20,null,null,"Orient D 1-1"]
[null,20,"Division 2","Orient (H) D 1-1",null,null,14,22,32,1,25,4,15,19,14,22,null,null,37,26,3,15,20,null,null,"Sunderland L 0-2"]
[null,21,"Division 2","Sunderland (A) L 0-2",null,null,14,21,33,1,25,4,16,19,14,22,null,null,39,26,3,16,20,null,null,"Sheff Wed W 2-1"]
[null,22,"Division 2","Sheff Wed (H) W 2-1",null,null,16,22,35,1,27,4,17,19,16,22,null,null,40,28,3,17,20,null,null,"Oxford L 1-3"]
[null,23,"Division 2","Oxford (A) L 1-3",null,null,16,22,37,1,27,4,18,19,16,22,null,null,41,29,3,17,20,null,null,"Portsmouth D 0-0"]
[null,24,"Division 2","Portsmouth (H) D 0-0",null,null,17,22,37,1,29,4,19,19,17,22,null,null,42,31,3,19,20,null,null,"Orient L 1-2"]
[null,25,"Division 2","Orient (A) L 1-2",null,null,17,22,39,1,29,4,21,19,17,22,null,null,44,31,3,19,20,null,null,"Notts Co W 3-0"]
[null,26,"Division 2","Notts Co (H) W 3-0",null,null,19,22,40,1,30,4,22,19,18,22,null,null,46,31,3,20,20,null,null,"Cardiff W 5-1"]
[null,27,"Division 2","Cardiff (H) W 5-1",null,null,21,21,40,1,30,4,22,19,18,22,null,null,47,31,3,21,20,null,null,"Cardiff W 5-1"]
[null,28,"Division 2","Bolton (A) L 0-2",null,null,21,21,40,1,32,4,23,19,18,22,null,null,49,33,3,22,20,null,null,"Bolton L 0-2"]
[null,29,"Division 2","Oldham (H) D 0-0",null,null,22,21,40,1,33,4,24,19,19,22,null,null,51,35,3,23,20,null,null,"Oldham D 0-0"]
[null,30,"Division 2","Cardiff (A) W 1-0",null,null,24,19,40,1,33,4,24,19,19,22,null,null,52,35,3,24,20,null,null,"Cardiff W 1-0"]
[null,31,"Division 2","York (H) L 1-3",null,null,24,20,42,1,37,4,26,19,19,22,null,null,55,38,3,24,20,null,null,"York L 1-3"]
[null,32,"Division 2","Fulham (A) D 0-0",null,null,25,20,44,1,37,4,26,19,19,22,null,null,59,38,3,25,20,null,null,"Fulham D 0-0"]
[null,33,"Division 2","Hull City (H) W 2-0",null,null,27,19,46,1,39,4,27,19,19,22,null,null,61,40,3,26,20,null,null,"Hull City W 2-0"]
[null,34,"Division 2","Bristol C (A) L 1-2",null,null,27,19,47,1,40,4,27,19,19,22,null,null,63,42,3,27,20,null,null,"Bristol C L 1-2"]
[null,35,"Division 2","Blackpool (H) D 0-0",null,null,28,20,49,1,42,4,29,19,20,22,null,null,65,42,3,28,20,null,null,"Blackpool D 0-0"]
[null,36,"Division 2","Sheff Wed (A) W 1-0",null,null,30,20,52,1,44,4,30,19,20,22,null,null,69,44,3,30,20,null,null,"Portsmouth L 0-1"]
[null,37,"Division 2","Portsmouth (A) L 0-1",null,null,30,19,54,1,44,4,30,19,20,22,null,null,70,44,3,30,20,null,null,"Portsmouth L 0-1"]
[null,38,"Division 2","Aston Villa (H) L 1-3",null,null,30,20,54,1,44,4,31,19,20,22,null,null,71,46,3,30,20,null,null,"Aston Villa L 1-3"]
[null,39,"Division 2","West Brom (A) L 1-2",null,null,30,21,56,1,46,4,33,19,20,22,null,null,73,46,3,31,20,null,null,"West Brom L 1-2"]
[null,40,"Division 2","Norwich (H) D 1-1",null,null,31,21,58,1,49,4,33,19,20,22,null,null,76,49,3,32,20,null,null,"Norwich D 1-1"]
[null,41,"Division 2","Southampton (A) L 2-3",null,null,31,21,58,1,49,4,33,19,20,22,null,null,78,49,3,32,20,null,null,"Norwich D 1-1"]
[null,42,"Division 2","Bristol R (H) D 1-1",null,null,32,20,61,1,51,4,35,19,21,22,null,null,82,53,3,32,20,null,null,"Bristol R D 1-1"]

{"sheet":"Sheet3","index":4,"n_rows":144,"n_cols":57,"rows_kept":144,"cut":false,"hidden":false,"merged":[[23,50,25,50],[7,1,9,1],[8,50,10,50],[13,50,15,50],[17,1,19,1],[18,50,20,50],[63,50,65,50],[27,1,29,1],[28,50,30,50],[33,50,35,50],[37,1,39,1],[38,50,40,50],[43,50,45,50],[47,1,49,1],[48,50,50,50],[53,50,55,50],[57,1,59,1],[58,50,60,50],[103,50,105,50],[67,1,69,1],[68,50,70,50],[73,50,75,50],[77,1,79,1],[78,50,80,50],[83,50,85,50],[87,1,89,1],[88,50,90,50],[93,50,95,50],[97,1,99,1],[98,50,100,50],[127,1,129,1],[107,1,109,1],[108,50,110,50],[113,50,115,50],[117,1,119,1],[118,50,120,50],[123,50,125,50]]}
[]
[null,null,null,null,null,null,null,null,null,null,null,null,null,null,null,null,null,null,null,null,null,null,null,null,null,null,null,null,null,null,null,null,null,null,null,null,null,null,null,null,null,null,null,null,null,null,null,null,null,null,null,null,null,null,null,5,46]
[]
[]
[]
[null,null,"Points",null,null,null,null,null,null,null,null,null,null,null,null,null,null,null,null,null,null,null,null,null,null,null,null,null,null,null,null,null,null,null,null,null,null,null,null,null,null,null,null,null,null,null,null,null,null,"Position"]
[]
[null,60]
[null,null,null,null,null,null,null,null,null,null,null,null,null,null,null,null,null,null,null,null,null,null,null,null,null,null,null,null,null,null,null,null,null,null,null,null,null,null,null,null,null,null,null,null,null,null,null,null,null,null,1]
[]
[]
[]
[]
[null,null,null,null,null,null,null,null,null,null,null,null,null,null,null,null,null,null,null,null,null,null,null,null,null,null,null,null,null,null,null,null,null,null,null,null,null,null,null,null,null,null,null,null,null,null,null,null,null,null,2]
[]
[]
[]
[null,55]
[null,null,null,null,null,null,null,null,null,null,null,null,null,null,null,null,null,null,null,null,null,null,null,null,null,null,null,null,null,null,null,null,null,null,null,null,null,null,null,null,null,null,null,null,null,null,null,null,null,null,3]
[]
[]
[]
[]
[null,null,null,null,null,null,null,null,null,null,null,null,null,null,null,null,null,null,null,null,null,null,null,null,null,null,null,null,null,null,null,null,null,null,null,null,null,null,null,null,null,null,null,null,null,null,null,null,null,null,4]
[]
[]
[]
[null,50]
[null,null,null,null,null,null,null,null,null,null,null,null,null,null,null,null,null,null,null,null,null,null,null,null,null,null,null,null,null,null,null,null,null,null,null,null,null,null,null,null,null,null,null,null,null,null,null,null,null,null,5]
[]
[]
[]
[]
[null,null,null,null,null,null,null,null,null,null,null,null,null,null,null,null,null,null,null,null,null,null,null,null,null,null,null,null,null,null,null,null,null,null,null,null,null,null,null,null,null,null,null,null,null,null,null,null,null,null,6]
[]
[]
[]
[null,45]
[null,null,null,null,null,null,null,null,null,null,null,null,null,null,null,null,null,null,null,null,null,null,null,null,null,null,null,null,null,null,null,null,null,null,null,null,null,null,null,null,null,null,null,null,null,null,null,null,null,null,7]
[]
[]
[]
[]
[null,null,null,null,null,null,null,null,null,null,null,null,null,null,null,null,null,null,null,null,null,null,null,null,null,null,null,null,null,null,null,null,null,null,null,null,null,null,null,null,null,null,null,null,null,null,null,null,null,null,8]
[]
[]
[]
[null,40]
[null,null,null,null,null,null,null,null,null,null,null,null,null,null,null,null,null,null,null,null,null,null,null,null,null,null,null,null,null,null,null,null,null,null,null,null,null,null,null,null,null,null,null,null,null,null,null,null,null,null,9]
[]
[]
[]
[]
[null,null,null,null,null,null,null,null,null,null,null,null,null,null,null,null,null,null,null,null,null,null,null,null,null,null,null,null,null,null,null,null,null,null,null,null,null,null,null,null,null,null,null,null,null,null,null,null,null,null,10]
[]
[]
[]
[null,35]
[null,null,null,null,null,null,null,null,null,null,null,null,null,null,null,null,null,null,null,null,null,null,null,null,null,null,null,null,null,null,null,null,null,null,null,null,null,null,null,null,null,null,null,null,null,null,null,null,null,null,11]
[]
[]
[]
[]
[null,null,null,null,null,null,null,null,null,null,null,null,null,null,null,null,null,null,null,null,null,null,null,null,null,null,null,null,null,null,null,null,null,null,null,null,null,null,null,null,null,null,null,null,null,null,null,null,null,null,12]
[]
[]
[]
[null,30]
[null,null,null,null,null,null,null,null,null,null,null,null,null,null,null,null,null,null,null,null,null,null,null,null,null,null,null,null,null,null,null,null,null,null,null,null,null,null,null,null,null,null,null,null,null,null,null,null,null,null,13]
[]
[]
[]
[]
[null,null,null,null,null,null,null,null,null,null,null,null,null,null,null,null,null,null,null,null,null,null,null,null,null,null,null,null,null,null,null,null,null,null,null,null,null,null,null,null,null,null,null,null,null,null,null,null,null,null,14]
[]
[]
[]
[null,25]
[null,null,null,null,null,null,null,null,null,null,null,null,null,null,null,null,null,null,null,null,null,null,null,null,null,null,null,null,null,null,null,null,null,null,null,null,null,null,null,null,null,null,null,null,null,null,null,null,null,null,15]
[]
[]
[]
[]
[null,null,null,null,null,null,null,null,null,null,null,null,null,null,null,null,null,null,null,null,null,null,null,null,null,null,null,null,null,null,null,null,null,null,null,null,null,null,null,null,null,null,null,null,null,null,null,null,null,null,16]
[]
[]
[]
[null,20]
[null,null,null,null,null,null,null,null,null,null,null,null,null,null,null,null,null,null,null,null,null,null,null,null,null,null,null,null,null,null,null,null,null,null,null,null,null,null,null,null,null,null,null,null,null,null,null,null,null,null,17]
[]
[]
[]
[]
[null,null,null,null,null,null,null,null,null,null,null,null,null,null,null,null,null,null,null,null,null,null,null,null,null,null,null,null,null,null,null,null,null,null,null,null,null,null,null,null,null,null,null,null,null,null,null,null,null,null,18]
[]
[]
[]
[null,15]
[null,null,null,null,null,null,null,null,null,null,null,null,null,null,null,null,null,null,null,null,null,null,null,null,null,null,null,null,null,null,null,null,null,null,null,null,null,null,null,null,null,null,null,null,null,null,null,null,null,null,19]
[]
[]
[]
[]
[null,null,null,null,null,null,null,null,null,null,null,null,null,null,null,null,null,null,null,null,null,null,null,null,null,null,null,null,null,null,null,null,null,null,null,null,null,null,null,null,null,null,null,null,null,null,null,null,null,null,20]
[]
[]
[]
[null,10]
[null,null,null,null,null,null,null,null,null,null,null,null,null,null,null,null,null,null,null,null,null,null,null,null,null,null,null,null,null,null,null,null,null,null,null,null,null,null,null,null,null,null,null,null,null,null,null,null,null,null,21]
[]
[]
[]
[]
[null,null,null,null,null,null,null,null,null,null,null,null,null,null,null,null,null,null,null,null,null,null,null,null,null,null,null,null,null,null,null,null,null,null,null,null,null,null,null,null,null,null,null,null,null,null,null,null,null,null,22]
[]
[]
[]
[null,5]
[]
[]
[]
[]
[]
[]
[]
[]
[]
[null,0]
[]
[]
[]
[null,null,null,{"$f":"#REF!","v":{"$error":"#REF!"}},"Sunderland (H) L 1-4","Nottm Forest (H) W 3-0","Man Utd (A) L 0-4","Nottm Forest (A) L 1-2","Fulham (H) W 2-0","Blackpool (A) L 0-1","Oxford (H) D 0-0","Man Utd (H) L 0-1","Aston Villa (A) L 0-3","Hull City (A) D 1-1","Bristol C (H) W 1-0","Norwich (A) L 0-2","Southampton (H) W 4-0","Bristol R (A) L 0-2","West Brom (H) D 2-2","Oldham (A) D 1-1","Bolton (H) D 1-1","York (A) L 1-2","Notts Co (A) L 1-2","Orient (H) D 1-1","Sunderland (A) L 0-2","Sheff Wed (H) W 2-1","Oxford (A) L 1-3","Portsmouth (H) D 0-0","Orient (A) L 1-2","Notts Co (H) W 3-0","Cardiff (H) W 5-1","Bolton (A) L 0-2","Oldham (H) D 0-0","Cardiff (A) W 1-0","York (H) L 1-3","Fulham (A) D 0-0","Hull City (H) W 2-0","Bristol C (A) L 1-2","Blackpool (H) D 0-0","Sheff Wed (A) W 1-0","Portsmouth (A) L 0-1","Aston Villa (H) L 1-3","West Brom (A) L 1-2","Norwich (H) D 1-1","Southampton (A) L 2-3","Bristol R (H) D 1-1",{"$f":"#REF!","v":{"$error":"#REF!"}},{"$f":"#REF!","v":{"$error":"#REF!"}},{"$f":"#REF!","v":{"$error":"#REF!"}}]
[]
[]
[]
[]
[]
[null,"Millwall",null,null,{"$f":"Sheet2!$G$6","v":0},{"$f":"Sheet2!$G$7","v":2},{"$f":"Sheet2!$G$8","v":2},{"$f":"Sheet2!$G$9","v":2},{"$f":"Sheet2!$G$10","v":4},{"$f":"Sheet2!$G$11","v":4},{"$f":"Sheet2!$G$12","v":5},{"$f":"Sheet2!$G$13","v":5},{"$f":"Sheet2!$G$14","v":5},{"$f":"Sheet2!$G$15","v":6},{"$f":"Sheet2!$G$16","v":8},{"$f":"Sheet2!$G$17","v":8},{"$f":"Sheet2!$G$18","v":10},{"$f":"Sheet2!$G$19","v":10},{"$f":"Sheet2!$G$20","v":11},{"$f":"Sheet2!$G$21","v":12},{"$f":"Sheet2!$G$22","v":13},{"$f":"Sheet2!$G$23","v":13},{"$f":"Sheet2!$G$24","v":13},{"$f":"Sheet2!$G$25","v":14},{"$f":"Sheet2!$G$26","v":14},{"$f":"Sheet2!$G$27","v":16},{"$f":"Sheet2!$G$28","v":16},{"$f":"Sheet2!$G$29","v":17},{"$f":"Sheet2!$G$30","v":17},{"$f":"Sheet2!$G$31","v":19},{"$f":"Sheet2!$G$32","v":21},{"$f":"Sheet2!$G$33","v":21},{"$f":"Sheet2!$G$34","v":22},{"$f":"Sheet2!$G$35","v":24},{"$f":"Sheet2!$G$36","v":24},{"$f":"Sheet2!$G$37","v":25},{"$f":"Sheet2!$G$38","v":27},{"$f":"Sheet2!$G$39","v":27},{"$f":"Sheet2!$G$40","v":28},{"$f":"Sheet2!$G$41","v":30},{"$f":"Sheet2!$G$42","v":30},{"$f":"Sheet2!$G$43","v":30},{"$f":"Sheet2!$G$44","v":30},{"$f":"Sheet2!$G$45","v":31},{"$f":"Sheet2!$G$46","v":31},{"$f":"Sheet2!$G$47","v":32}]
[]
[null,"Position",null,null,{"$f":"125-(E144*5)","v":30},{"$f":"125-(F144*5)","v":90},60,35,65,50,45,35,20,35,35,25,45,30,35,30,30,30,25,15,20,15,15,15,15,15,20,20,20,30,25,25,30,30,25,25,30,25,20,20,20,25]
[]
[]
[]
[null,null,null,null,{"$f":"Sheet2!$H$6","v":19},{"$f":"Sheet2!$H$7","v":7},{"$f":"Sheet2!$H$8","v":13},{"$f":"Sheet2!$H$9","v":18},{"$f":"Sheet2!$H$10","v":12},{"$f":"Sheet2!$H$11","v":15},{"$f":"Sheet2!$H$12","v":16},{"$f":"Sheet2!$H$13","v":18},{"$f":"Sheet2!$H$14","v":21},{"$f":"Sheet2!$H$15","v":18},{"$f":"Sheet2!$H$16","v":18},{"$f":"Sheet2!$H$17","v":20},{"$f":"Sheet2!$H$18","v":16},{"$f":"Sheet2!$H$19","v":19},{"$f":"Sheet2!$H$20","v":18},{"$f":"Sheet2!$H$21","v":19},{"$f":"Sheet2!$H$22","v":19},{"$f":"Sheet2!$H$23","v":19},{"$f":"Sheet2!$H$24","v":20},{"$f":"Sheet2!$H$25","v":22},{"$f":"Sheet2!$H$26","v":21},{"$f":"Sheet2!$H$27","v":22},{"$f":"Sheet2!$H$28","v":22},{"$f":"Sheet2!$H$29","v":22},{"$f":"Sheet2!$H$30","v":22},{"$f":"Sheet2!$H$31","v":22},{"$f":"Sheet2!$H$32","v":21},{"$f":"Sheet2!$H$33","v":21},{"$f":"Sheet2!$H$34","v":21},{"$f":"Sheet2!$H$35","v":19},{"$f":"Sheet2!$H$36","v":20},{"$f":"Sheet2!$H$37","v":20},{"$f":"Sheet2!$H$38","v":19},{"$f":"Sheet2!$H$39","v":19},{"$f":"Sheet2!$H$40","v":20},{"$f":"Sheet2!$H$41","v":20},{"$f":"Sheet2!$H$42","v":19},{"$f":"Sheet2!$H$43","v":20},{"$f":"Sheet2!$H$44","v":21},{"$f":"Sheet2!$H$45","v":21},{"$f":"Sheet2!$H$46","v":21},{"$f":"Sheet2!$H$47","v":20}]