{"text_format":"1","workbook":"xlsx","n_sheets":5,"sheets":["Millwall","Comparison","Sheet1","Sheet2","Sheet3"],"not_rendered":{"charts":1,"images":2,"macros":1,"external_links":5,"defined_names":14,"comments":0,"pivot_tables":0},"unopened":[],"bounds":{"document_bytes":16777216,"sheet_cells":100000,"rows_first":2000,"rows_last":500,"rows_between":2000,"halvings":0,"cell_chars":16384,"cell_head_chars":4096},"cells_cut":0,"cells_raw":0,"read":"whole","date_system":"1900"}

{"sheet":"Millwall","index":0,"n_rows":201,"n_cols":147,"rows_kept":201,"cut":false,"hidden":false,"merged":[[2,146,2,158],[2,68,2,71],[2,72,2,75],[50,85,50,87],[50,80,50,82],[50,68,50,70],[50,72,50,74],[50,76,50,78],[4,66,4,67],[2,77,2,79],[69,69,69,71],[69,73,69,75],[69,77,69,79],[65,64,65,98]]}
[null,null,1,"Competition","Date",null,"Us & Them","Opponents",null,null,null,"Score","HT",null,null,null,null,null,null,null,null,null,null,"Att",null,"Pts","Pos","Goal Scorers",null,null,null,null,null,null,null,null,null,null,null,null,null,null,null,null,null,null,null,null,null,null,null,null,null,null,null,null,null,null,null,null,null,null,null,null,null,null,null,null,null,null,null,null,null,null,null,null,null,null,null,null,null,null,null,null,null,null,null,null,null,null,null,null,null,null,null,null,1,874]
[null,null,null,null,null,null,null,null,null,null,null,null,null,null,null,null,null,null,null,null,null,null,null,null,null,null,null,null,null,null,null,null,null,null,null,null,null,null,null,null,null,"x"]
[null,null,null,null,null,null,null,null,null,null,null,null,"x",null,null,null,null,null,null,null,null,null,null,null,null,null,null,null,null,null,null,null,null,null,null,null,null,null,null,null,null,"x",null,null,null,null,null,null,null,null,null,null,null,null,null,null,null,null,null,null,null,null,null,null,null,null,null,null,"All",null,null,null,"League",null,null,null,null,"FA Cup",null,null,null,null,null,null,null,null,null,null,null,null,null,null,null,null,null,null,null,null,null,null,null,null,null,null,null,null,null,null,null,null,null,null,null,null,null,null,null,null,null,null,null,null,null,null,null,null,null,null,null,null,null,null,null,null,null,null,null,null,null,null,null,null,null,null,null,null,"Millwall Progress Season 1964/65"]
[null,null,"Game","Competition","Date",null,"Us & Them","Opponents",null,null,null,"Score","HT",null,null,null,null,null,null,null,null,null,null,"Att","Away","Pts","Pos","Goal Scorers",null,null,null,null,"Game","Competition","Date",null,"Opponents",null,null,null,"Score",1,2,3,4,5,6,7,8,9,10,11,null,null,12,null,null,null,null,null,null,null,null,null,null,null,null,null,null,{"$f":"BQ51","v":"Max (45)"},null,null,null,{"$f":"BU51","v":"Max (42)"},null,null,null,{"$f":"BY51","v":"Max (3)"},null,null,null,null,null,null,null,null,null,null,null,null,null,null,null,null,null,null,null,null,1,2,3,4,5,6,7,8,9,10,11,null,11,12,13,14,null,16,17,18,null,null,null,null,null,null,null,null,null,null,null,null,null,null,null,null,null,null,null,null,null,null,"Opposition","Pts","Pos"]
[1,null,1,"Division 2","1938-08-27",null,"- -","Chesterfield","(H)",null,null,"W 3-1","0-0","W",3,1,null,null,null,null,null,null,null,31920,null,2,6,"Walsh, Rawlings (2)",null,null,1,null,{"$f":"C5","v":1},"Division 2","1938-08-27",null,"Chesterfield","(H)",null,null,"W 3-1","Pearson","E Smith","Inns","Brolly","Wallbanks","Forsyth","Rawlings","Richardson","Walsh","Barker","JR Smith",null,null,null,null,null,null,null,null,null,null,null,null,null,null,"Player      ",null,"Apps","-","-","Goals","Apps","-","-","Goals","Apps","-","-","Goals",null,null,null,null,null,null,null,null,null,null,null,null,null,null,null,null,null,null,"Pearson","Lea","Dudley","Brolly","Chiverton","Forsyth","Fisher","Richardson","McLeod","Barker","JR Smith",null,null,null,null,null,null,null,null,null,null,null,null,null,null,null,null,null,null,null,null,null,null,null,null,null,null,null,null,null,null,null,"Chesterfield (H) W 3-1",2,6]
[{"$f":"IF(A5=0,1,IF(A5=2,1,2))","v":2},null,2,"Division 2","1938-08-29",null,"6th v 13th","Tranmere","(A)",null,null,"L 0-2","0-2","L",0,2,null,null,null,null,null,null,null,18000,null,2,11,null,null,null,{"$f":"IF(AE5=0,1,IF(AE5=2,1,2))","v":2},null,2,"Division 2","1938-08-29",null,"Tranmere","(A)",null,null,"L 0-2","Pearson","E Smith","Inns","Brolly","Chiverton","Forsyth","Rawlings","Richardson","Walsh","Barker","JR Smith",null,null,null,null,null,null,null,null,null,null,null,null,null,null,null,null,null,null,null,null,null,null,null,null,null,null,null,null,null,null,null,null,null,null,null,null,null,null,null,null,null,null,null,null,null,null,null,null,null,null,null,null,null,null,null,null,null,null,null,null,null,null,null,null,null,null,null,null,null,null,null,null,null,null,null,null,null,null,null,null,null,null,null,null,null,null,null,null,"Tranmere (A) L 0-2",2,11]
[1,null,3,"Division 2","1938-09-03",null,"12th v 16th","Swansea","(A)",null,null,"D 1-1","1-1","D",1,1,null,null,null,null,null,null,null,17000,null,3,12,"Hedley",null,null,1,null,3,"Division 2","1938-09-03",null,"Swansea","(A)",null,null,"D 1-1","Pearson","E Smith","Inns","Barker","Chiverton","Forsyth","Rawlings","Richardson","Walsh","JR Smith","Hedley",null,null,null,null,null,null,null,null,null,null,null,null,1,null,{"$f":"CN7&\" \"&CO7","v":"D Barker"},null,{"$f":"BU7+BY7","v":42},"-","-",{"$f":"BX7+CB7","v":12},{"$f":"BR72","v":39},"-","-",12,{"$f":"BZ72","v":3},"-","-",0,null,null,{"$f":"IF(BU7=CF7,IF(BY7=CL7,\"OK\",\"Error\"),\"Error\")","v":"OK"},39,null,null,null,null,null,3,{"$f":"CM72","v":72},"D","Barker",1,7,null,"Barker",null,"Pearson","Lea","Dudley","Brolly","Chiverton","Forsyth","Fisher","Richardson","McLeod","Barker","JR Smith",null,null,null,null,null,null,null,null,null,null,null,null,null,null,null,null,null,null,null,null,null,null,null,null,null,null,null,null,null,null,null,"Swansea (A) D 1-1",3,12]
[2,null,4,"Division 2","1938-09-05",null,"12th v 15th","Bury","(H)",null,null,"D 0-0","0-0","D",0,0,null,null,null,null,null,null,null,18606,null,4,11,null,null,null,2,null,4,"Division 2","1938-09-05",null,"Bury","(H)",null,null,"D 0-0","Pearson","E Smith","Inns","Brolly","Chiverton","Forsyth","Rawlings","Richardson","Walsh","JR Smith","Hedley",null,null,null,null,null,null,null,null,null,null,null,null,{"$f":"IF(BM7=0,1,IF(BM7=2,1,2))","v":2},null,"Tom Brolly",null,{"$f":"BU8+BY8","v":34},"-","-",{"$f":"BX8+CB8","v":1},31,"-","-",1,3,"-","-",0,null,null,"OK",31,null,null,null,null,null,3,73,"Tom","Brolly",2,8,null,"Brolly",null,null,null,null,null,null,null,null,null,null,null,null,null,null,null,null,null,null,null,null,null,null,null,null,null,null,null,null,null,null,null,null,null,null,null,null,null,null,null,null,null,null,null,"Bury (H) D 0-0",4,11]
{"$rows_left_out":194}
{"sheet":"Comparison","index":1,"n_rows":180,"n_cols":44,"rows_kept":180,"cut":false,"hidden":false,"merged":[]}
[]
[]
["Formulas",null,null,null,null,"Date",null,"Opponents","Venue / Result",null,{"$f":"Millwall!$BP$72","v":"Barker"},{"$f":"Millwall!$BP$73","v":"Brolly"},{"$f":"Millwall!$BP$74","v":"Burke"},{"$f":"Millwall!$BP$75","v":"Chiverton"},{"$f":"Millwall!$BP$76","v":"Daniels"},{"$f":"Millwall!$BP$77","v":"Dudley"},{"$f":"Millwall!$BP$78","v":"Fenton"},{"$f":"Millwall!$BP$79","v":"Fisher"},{"$f":"Millwall!$BP$80","v":"Forsyth"},{"$f":"Millwall!$BP$81","v":"Hedley"},{"$f":"Millwall!$BP$82","v":"Inns"},{"$f":"Millwall!$BP$83","v":"Jinks"},{"$f":"Millwall!$BP$84","v":"Lea"},{"$f":"Millwall!$BP$85","v":"McLeod"},{"$f":"Millwall!$BP$86","v":"Osman"},{"$f":"Millwall!$BP$87","v":"Pearson"},{"$f":"Millwall!$BP$88","v":"Rawlings"},{"$f":"Millwall!$BP$89","v":"Richardson"},{"$f":"Millwall!$BP$90","v":"E Smith"},{"$f":"Millwall!$BP$91","v":"JR Smith"},{"$f":"Millwall!$BP$92","v":"Sykes"},{"$f":"Millwall!$BP$93","v":"Thorogood"},{"$f":"Millwall!$BP$94","v":"Wallbanks"},{"$f":"Millwall!$BP$95","v":"Walsh"},{"$f":"Millwall!$BP$96","v":"Williams"},{"$f":"Millwall!$BP$97","v":"Yuill"},{"$f":"Millwall!$BP$98","v":0},{"$f":"Millwall!$BP$99","v":0},{"$f":"Millwall!$BP$100","v":0},{"$f":"Millwall!$BP$101","v":0},{"$f":"Millwall!$BP$102","v":0},{"$f":"Millwall!$BP$103","v":"Own Goal"},{"$f":"Millwall!$BP$104","v":0},{"$f":"Millwall!$BP$105","v":0}]
[null,null,null,1,null,{"$f":"Millwall!AI78","v":"1938-08-27"},null,{"$f":"Millwall!AK78","v":"Chesterfield"},{"$f":"Millwall!AL78","v":"(H)"},{"$f":"Millwall!AO78","v":"W 3-1"},{"$f":"MATCH(K$3,Millwall!$AP78:$AZ78,0)","v":10},{"$f":"MATCH(L$3,Millwall!$AP78:$AZ78,0)","v":4},{"$f":"MATCH(M$3,Millwall!$AP78:$AZ78,0)","v":{"$error":"#N/A"}},{"$f":"MATCH(N$3,Millwall!$AP78:$AZ78,0)","v":{"$error":"#N/A"}},{"$f":"MATCH(O$3,Millwall!$AP78:$AZ78,0)","v":{"$error":"#N/A"}},{"$f":"MATCH(P$3,Millwall!$AP78:$AZ78,0)","v":{"$error":"#N/A"}},{"$f":"MATCH(Q$3,Millwall!$AP78:$AZ78,0)","v":{"$error":"#N/A"}},{"$f":"MATCH(R$3,Millwall!$AP78:$AZ78,0)","v":{"$error":"#N/A"}},{"$f":"MATCH(S$3,Millwall!$AP78:$AZ78,0)","v":6},{"$f":"MATCH(T$3,Millwall!$AP78:$AZ78,0)","v":{"$error":"#N/A"}},{"$f":"MATCH(U$3,Millwall!$AP78:$AZ78,0)","v":3},{"$f":"MATCH(V$3,Millwall!$AP78:$AZ78,0)","v":{"$error":"#N/A"}},{"$f":"MATCH(W$3,Millwall!$AP78:$AZ78,0)","v":{"$error":"#N/A"}},{"$f":"MATCH(X$3,Millwall!$AP78:$AZ78,0)","v":{"$error":"#N/A"}},{"$f":"MATCH(Y$3,Millwall!$AP78:$AZ78,0)","v":{"$error":"#N/A"}},{"$f":"MATCH(Z$3,Millwall!$AP78:$AZ78,0)","v":1},{"$f":"MATCH(AA$3,Millwall!$AP78:$AZ78,0)","v":7},{"$f":"MATCH(AB$3,Millwall!$AP78:$AZ78,0)","v":8},{"$f":"MATCH(AC$3,Millwall!$AP78:$AZ78,0)","v":2},{"$f":"MATCH(AD$3,Millwall!$AP78:$AZ78,0)","v":11},{"$f":"MATCH(AE$3,Millwall!$AP78:$AZ78,0)","v":{"$error":"#N/A"}},{"$f":"MATCH(AF$3,Millwall!$AP78:$AZ78,0)","v":{"$error":"#N/A"}},{"$f":"MATCH(AG$3,Millwall!$AP78:$AZ78,0)","v":5},{"$f":"MATCH(AH$3,Millwall!$AP78:$AZ78,0)","v":9},{"$f":"MATCH(AI$3,Millwall!$AP78:$AZ78,0)","v":{"$error":"#N/A"}},{"$f":"MATCH(AJ$3,Millwall!$AP78:$AZ78,0)","v":{"$error":"#N/A"}},{"$f":"MATCH(AK$3,Millwall!$AP78:$AZ78,0)","v":{"$error":"#N/A"}},{"$f":"MATCH(AL$3,Millwall!$AP78:$AZ78,0)","v":{"$error":"#N/A"}},{"$f":"MATCH(AM$3,Millwall!$AP78:$AZ78,0)","v":{"$error":"#N/A"}},{"$f":"MATCH(AN$3,Millwall!$AP78:$AZ78,0)","v":{"$error":"#N/A"}},{"$f":"MATCH(AO$3,Millwall!$AP78:$AZ78,0)","v":{"$error":"#N/A"}},{"$f":"MATCH(AP$3,Millwall!$AP78:$AZ78,0)","v":{"$error":"#N/A"}},{"$f":"MATCH(AQ$3,Millwall!$AP78:$AZ78,0)","v":{"$error":"#N/A"}},{"$f":"MATCH(AR$3,Millwall!$AP78:$AZ78,0)","v":{"$error":"#N/A"}}]
[null,null,null,2,null,{"$f":"Millwall!AI79","v":"1938-08-29"},null,{"$f":"Millwall!AK79","v":"Tranmere"},{"$f":"Millwall!AL79","v":"(A)"},{"$f":"Millwall!AO79","v":"L 0-2"},{"$f":"MATCH(K$3,Millwall!$AP79:$AZ79,0)","v":10},{"$f":"MATCH(L$3,Millwall!$AP79:$AZ79,0)","v":4},{"$f":"MATCH(M$3,Millwall!$AP79:$AZ79,0)","v":{"$error":"#N/A"}},{"$f":"MATCH(N$3,Millwall!$AP79:$AZ79,0)","v":5},{"$f":"MATCH(O$3,Millwall!$AP79:$AZ79,0)","v":{"$error":"#N/A"}},{"$f":"MATCH(P$3,Millwall!$AP79:$AZ79,0)","v":{"$error":"#N/A"}},{"$f":"MATCH(Q$3,Millwall!$AP79:$AZ79,0)","v":{"$error":"#N/A"}},{"$f":"MATCH(R$3,Millwall!$AP79:$AZ79,0)","v":{"$error":"#N/A"}},{"$f":"MATCH(S$3,Millwall!$AP79:$AZ79,0)","v":6},{"$f":"MATCH(T$3,Millwall!$AP79:$AZ79,0)","v":{"$error":"#N/A"}},{"$f":"MATCH(U$3,Millwall!$AP79:$AZ79,0)","v":3},{"$f":"MATCH(V$3,Millwall!$AP79:$AZ79,0)","v":{"$error":"#N/A"}},{"$f":"MATCH(W$3,Millwall!$AP79:$AZ79,0)","v":{"$error":"#N/A"}},{"$f":"MATCH(X$3,Millwall!$AP79:$AZ79,0)","v":{"$error":"#N/A"}},{"$f":"MATCH(Y$3,Millwall!$AP79:$AZ79,0)","v":{"$error":"#N/A"}},{"$f":"MATCH(Z$3,Millwall!$AP79:$AZ79,0)","v":1},{"$f":"MATCH(AA$3,Millwall!$AP79:$AZ79,0)","v":7},{"$f":"MATCH(AB$3,Millwall!$AP79:$AZ79,0)","v":8},{"$f":"MATCH(AC$3,Millwall!$AP79:$AZ79,0)","v":2},{"$f":"MATCH(AD$3,Millwall!$AP79:$AZ79,0)","v":11},{"$f":"MATCH(AE$3,Millwall!$AP79:$AZ79,0)","v":{"$error":"#N/A"}},{"$f":"MATCH(AF$3,Millwall!$AP79:$AZ79,0)","v":{"$error":"#N/A"}},{"$f":"MATCH(AG$3,Millwall!$AP79:$AZ79,0)","v":{"$error":"#N/A"}},{"$f":"MATCH(AH$3,Millwall!$AP79:$AZ79,0)","v":9},{"$f":"MATCH(AI$3,Millwall!$AP79:$AZ79,0)","v":{"$error":"#N/A"}},{"$f":"MATCH(AJ$3,Millwall!$AP79:$AZ79,0)","v":{"$error":"#N/A"}},{"$f":"MATCH(AK$3,Millwall!$AP79:$AZ79,0)","v":{"$error":"#N/A"}},{"$f":"MATCH(AL$3,Millwall!$AP79:$AZ79,0)","v":{"$error":"#N/A"}},{"$f":"MATCH(AM$3,Millwall!$AP79:$AZ79,0)","v":{"$error":"#N/A"}},{"$f":"MATCH(AN$3,Millwall!$AP79:$AZ79,0)","v":{"$error":"#N/A"}},{"$f":"MATCH(AO$3,Millwall!$AP79:$AZ79,0)","v":{"$error":"#N/A"}},{"$f":"MATCH(AP$3,Millwall!$AP79:$AZ79,0)","v":{"$error":"#N/A"}},{"$f":"MATCH(AQ$3,Millwall!$AP79:$AZ79,0)","v":{"$error":"#N/A"}},{"$f":"MATCH(AR$3,Millwall!$AP79:$AZ79,0)","v":{"$error":"#N/A"}}]
[null,null,null,3,null,{"$f":"Millwall!AI80","v":"1938-09-03"},null,{"$f":"Millwall!AK80","v":"Swansea"},{"$f":"Millwall!AL80","v":"(A)"},{"$f":"Millwall!AO80","v":"D 1-1"},{"$f":"MATCH(K$3,Millwall!$AP80:$AZ80,0)","v":4},{"$f":"MATCH(L$3,Millwall!$AP80:$AZ80,0)","v":{"$error":"#N/A"}},{"$f":"MATCH(M$3,Millwall!$AP80:$AZ80,0)","v":{"$error":"#N/A"}},{"$f":"MATCH(N$3,Millwall!$AP80:$AZ80,0)","v":5},{"$f":"MATCH(O$3,Millwall!$AP80:$AZ80,0)","v":{"$error":"#N/A"}},{"$f":"MATCH(P$3,Millwall!$AP80:$AZ80,0)","v":{"$error":"#N/A"}},{"$f":"MATCH(Q$3,Millwall!$AP80:$AZ80,0)","v":{"$error":"#N/A"}},{"$f":"MATCH(R$3,Millwall!$AP80:$AZ80,0)","v":{"$error":"#N/A"}},{"$f":"MATCH(S$3,Millwall!$AP80:$AZ80,0)","v":6},{"$f":"MATCH(T$3,Millwall!$AP80:$AZ80,0)","v":11},{"$f":"MATCH(U$3,Millwall!$AP80:$AZ80,0)","v":3},{"$f":"MATCH(V$3,Millwall!$AP80:$AZ80,0)","v":{"$error":"#N/A"}},{"$f":"MATCH(W$3,Millwall!$AP80:$AZ80,0)","v":{"$error":"#N/A"}},{"$f":"MATCH(X$3,Millwall!$AP80:$AZ80,0)","v":{"$error":"#N/A"}},{"$f":"MATCH(Y$3,Millwall!$AP80:$AZ80,0)","v":{"$error":"#N/A"}},{"$f":"MATCH(Z$3,Millwall!$AP80:$AZ80,0)","v":1},{"$f":"MATCH(AA$3,Millwall!$AP80:$AZ80,0)","v":7},{"$f":"MATCH(AB$3,Millwall!$AP80:$AZ80,0)","v":8},{"$f":"MATCH(AC$3,Millwall!$AP80:$AZ80,0)","v":2},{"$f":"MATCH(AD$3,Millwall!$AP80:$AZ80,0)","v":10},{"$f":"MATCH(AE$3,Millwall!$AP80:$AZ80,0)","v":{"$error":"#N/A"}},{"$f":"MATCH(AF$3,Millwall!$AP80:$AZ80,0)","v":{"$error":"#N/A"}},{"$f":"MATCH(AG$3,Millwall!$AP80:$AZ80,0)","v":{"$error":"#N/A"}},{"$f":"MATCH(AH$3,Millwall!$AP80:$AZ80,0)","v":9},{"$f":"MATCH(AI$3,Millwall!$AP80:$AZ80,0)","v":{"$error":"#N/A"}},{"$f":"MATCH(AJ$3,Millwall!$AP80:$AZ80,0)","v":{"$error":"#N/A"}},{"$f":"MATCH(AK$3,Millwall!$AP80:$AZ80,0)","v":{"$error":"#N/A"}},{"$f":"MATCH(AL$3,Millwall!$AP80:$AZ80,0)","v":{"$error":"#N/A"}},{"$f":"MATCH(AM$3,Millwall!$AP80:$AZ80,0)","v":{"$error":"#N/A"}},{"$f":"MATCH(AN$3,Millwall!$AP80:$AZ80,0)","v":{"$error":"#N/A"}},{"$f":"MATCH(AO$3,Millwall!$AP80:$AZ80,0)","v":{"$error":"#N/A"}},{"$f":"MATCH(AP$3,Millwall!$AP80:$AZ80,0)","v":{"$error":"#N/A"}},{"$f":"MATCH(AQ$3,Millwall!$AP80:$AZ80,0)","v":{"$error":"#N/A"}},{"$f":"MATCH(AR$3,Millwall!$AP80:$AZ80,0)","v":{"$error":"#N/A"}}]
[null,null,null,4,null,{"$f":"Millwall!AI81","v":"1938-09-05"},null,{"$f":"Millwall!AK81","v":"Bury"},{"$f":"Millwall!AL81","v":"(H)"},{"$f":"Millwall!AO81","v":"D 0-0"},{"$f":"MATCH(K$3,Millwall!$AP81:$AZ81,0)","v":{"$error":"#N/A"}},{"$f":"MATCH(L$3,Millwall!$AP81:$AZ81,0)","v":4},{"$f":"MATCH(M$3,Millwall!$AP81:$AZ81,0)","v":{"$error":"#N/A"}},{"$f":"MATCH(N$3,Millwall!$AP81:$AZ81,0)","v":5},{"$f":"MATCH(O$3,Millwall!$AP81:$AZ81,0)","v":{"$error":"#N/A"}},{"$f":"MATCH(P$3,Millwall!$AP81:$AZ81,0)","v":{"$error":"#N/A"}},{"$f":"MATCH(Q$3,Millwall!$AP81:$AZ81,0)","v":{"$error":"#N/A"}},{"$f":"MATCH(R$3,Millwall!$AP81:$AZ81,0)","v":{"$error":"#N/A"}},{"$f":"MATCH(S$3,Millwall!$AP81:$AZ81,0)","v":6},{"$f":"MATCH(T$3,Millwall!$AP81:$AZ81,0)","v":11},{"$f":"MATCH(U$3,Millwall!$AP81:$AZ81,0)","v":3},{"$f":"MATCH(V$3,Millwall!$AP81:$AZ81,0)","v":{"$error":"#N/A"}},{"$f":"MATCH(W$3,Millwall!$AP81:$AZ81,0)","v":{"$error":"#N/A"}},{"$f":"MATCH(X$3,Millwall!$AP81:$AZ81,0)","v":{"$error":"#N/A"}},{"$f":"MATCH(Y$3,Millwall!$AP81:$AZ81,0)","v":{"$error":"#N/A"}},{"$f":"MATCH(Z$3,Millwall!$AP81:$AZ81,0)","v":1},{"$f":"MATCH(AA$3,Millwall!$AP81:$AZ81,0)","v":7},{"$f":"MATCH(AB$3,Millwall!$AP81:$AZ81,0)","v":8},{"$f":"MATCH(AC$3,Millwall!$AP81:$AZ81,0)","v":2},{"$f":"MATCH(AD$3,Millwall!$AP81:$AZ81,0)","v":10},{"$f":"MATCH(AE$3,Millwall!$AP81:$AZ81,0)","v":{"$error":"#N/A"}},{"$f":"MATCH(AF$3,Millwall!$AP81:$AZ81,0)","v":{"$error":"#N/A"}},{"$f":"MATCH(AG$3,Millwall!$AP81:$AZ81,0)","v":{"$error":"#N/A"}},{"$f":"MATCH(AH$3,Millwall!$AP81:$AZ81,0)","v":9},{"$f":"MATCH(AI$3,Millwall!$AP81:$AZ81,0)","v":{"$error":"#N/A"}},{"$f":"MATCH(AJ$3,Millwall!$AP81:$AZ81,0)","v":{"$error":"#N/A"}},{"$f":"MATCH(AK$3,Millwall!$AP81:$AZ81,0)","v":{"$error":"#N/A"}},{"$f":"MATCH(AL$3,Millwall!$AP81:$AZ81,0)","v":{"$error":"#N/A"}},{"$f":"MATCH(AM$3,Millwall!$AP81:$AZ81,0)","v":{"$error":"#N/A"}},{"$f":"MATCH(AN$3,Millwall!$AP81:$AZ81,0)","v":{"$error":"#N/A"}},{"$f":"MATCH(AO$3,Millwall!$AP81:$AZ81,0)","v":{"$error":"#N/A"}},{"$f":"MATCH(AP$3,Millwall!$AP81:$AZ81,0)","v":{"$error":"#N/A"}},{"$f":"MATCH(AQ$3,Millwall!$AP81:$AZ81,0)","v":{"$error":"#N/A"}},{"$f":"MATCH(AR$3,Millwall!$AP81:$AZ81,0)","v":{"$error":"#N/A"}}]
[null,null,null,5,null,{"$f":"Millwall!AI82","v":"1938-09-10"},null,{"$f":"Millwall!AK82","v":"Bradford PA"},{"$f":"Millwall!AL82","v":"(H)"},{"$f":"Millwall!AO82","v":"W 3-1"},{"$f":"MATCH(K$3,Millwall!$AP82:$AZ82,0)","v":10},{"$f":"MATCH(L$3,Millwall!$AP82:$AZ82,0)","v":4},{"$f":"MATCH(M$3,Millwall!$AP82:$AZ82,0)","v":{"$error":"#N/A"}},{"$f":"MATCH(N$3,Millwall!$AP82:$AZ82,0)","v":5},{"$f":"MATCH(O$3,Millwall!$AP82:$AZ82,0)","v":{"$error":"#N/A"}},{"$f":"MATCH(P$3,Millwall!$AP82:$AZ82,0)","v":{"$error":"#N/A"}},{"$f":"MATCH(Q$3,Millwall!$AP82:$AZ82,0)","v":{"$error":"#N/A"}},{"$f":"MATCH(R$3,Millwall!$AP82:$AZ82,0)","v":{"$error":"#N/A"}},{"$f":"MATCH(S$3,Millwall!$AP82:$AZ82,0)","v":6},{"$f":"MATCH(T$3,Millwall!$AP82:$AZ82,0)","v":{"$error":"#N/A"}},{"$f":"MATCH(U$3,Millwall!$AP82:$AZ82,0)","v":3},{"$f":"MATCH(V$3,Millwall!$AP82:$AZ82,0)","v":{"$error":"#N/A"}},{"$f":"MATCH(W$3,Millwall!$AP82:$AZ82,0)","v":{"$error":"#N/A"}},{"$f":"MATCH(X$3,Millwall!$AP82:$AZ82,0)","v":{"$error":"#N/A"}},{"$f":"MATCH(Y$3,Millwall!$AP82:$AZ82,0)","v":{"$error":"#N/A"}},{"$f":"MATCH(Z$3,Millwall!$AP82:$AZ82,0)","v":1},{"$f":"MATCH(AA$3,Millwall!$AP82:$AZ82,0)","v":7},{"$f":"MATCH(AB$3,Millwall!$AP82:$AZ82,0)","v":8},{"$f":"MATCH(AC$3,Millwall!$AP82:$AZ82,0)","v":2},{"$f":"MATCH(AD$3,Millwall!$AP82:$AZ82,0)","v":11},{"$f":"MATCH(AE$3,Millwall!$AP82:$AZ82,0)","v":{"$error":"#N/A"}},{"$f":"MATCH(AF$3,Millwall!$AP82:$AZ82,0)","v":{"$error":"#N/A"}},{"$f":"MATCH(AG$3,Millwall!$AP82:$AZ82,0)","v":{"$error":"#N/A"}},{"$f":"MATCH(AH$3,Millwall!$AP82:$AZ82,0)","v":9},{"$f":"MATCH(AI$3,Millwall!$AP82:$AZ82,0)","v":{"$error":"#N/A"}},{"$f":"MATCH(AJ$3,Millwall!$AP82:$AZ82,0)","v":{"$error":"#N/A"}},{"$f":"MATCH(AK$3,Millwall!$AP82:$AZ82,0)","v":{"$error":"#N/A"}},{"$f":"MATCH(AL$3,Millwall!$AP82:$AZ82,0)","v":{"$error":"#N/A"}},{"$f":"MATCH(AM$3,Millwall!$AP82:$AZ82,0)","v":{"$error":"#N/A"}},{"$f":"MATCH(AN$3,Millwall!$AP82:$AZ82,0)","v":{"$error":"#N/A"}},{"$f":"MATCH(AO$3,Millwall!$AP82:$AZ82,0)","v":{"$error":"#N/A"}},{"$f":"MATCH(AP$3,Millwall!$AP82:$AZ82,0)","v":{"$error":"#N/A"}},{"$f":"MATCH(AQ$3,Millwall!$AP82:$AZ82,0)","v":{"$error":"#N/A"}},{"$f":"MATCH(AR$3,Millwall!$AP82:$AZ82,0)","v":{"$error":"#N/A"}}]
{"$rows_left_out":173}
{"sheet":"Sheet1","index":2,"n_rows":195,"n_cols":63,"rows_kept":195,"cut":false,"hidden":false,"merged":[[5,1,7,1],[5,52,7,52],[15,1,17,1],[15,52,17,52],[25,1,27,1],[25,52,27,52],[35,1,37,1],[35,52,37,52],[45,1,47,1],[45,52,47,52],[55,1,57,1],[55,52,57,52],[65,1,67,1],[65,52,67,52],[75,1,77,1],[75,52,77,52],[85,1,87,1],[85,52,87,52],[95,1,97,1],[95,52,97,52],[105,1,107,1],[105,52,107,52],[115,1,117,1],[115,52,117,52],[155,1,157,1],[155,52,157,52],[200,13,200,14],[201,13,201,14],[125,1,127,1],[125,52,127,52],[135,1,137,1],[135,52,137,52],[145,1,147,1],[145,52,147,52]]}
[]
[null,null,null,null,null,null,null,null,null,null,null,null,null,null,null,null,null,null,null,null,null,null,null,null,null,null,null,null,null,null,null,null,null,null,null,null,null,null,null,null,null,null,null,null,null,null,null,null,null,null,null,null,null,null,null,null,null,null,null,null,null,null,{"$f":"158-70","v":88}]
[]
[]
[]
[null,75,null,null,null,null,null,null,null,null,null,null,null,null,null,null,null,null,null,null,null,null,null,null,null,null,null,null,null,null,null,null,null,null,null,null,null,null,null,null,null,null,null,null,null,null,null,null,null,null,null,null,75]
[]
[]
{"$rows_left_out":188}
{"sheet":"Sheet2","index":3,"n_rows":48,"n_cols":26,"rows_kept":48,"cut":false,"hidden":false,"merged":[]}
[null,null,"Millwall 1938/39 results and fixtures ",null,null,null,{"$f":"[5]Summary!$AP$64","v":42},{"$f":"[5]Summary!$Q$22","v":13},{"$f":"[5]Summary!$AP$10","v":55},1,{"$f":"[5]Summary!$AP$12","v":53},2,{"$f":"[5]Summary!$AP$29","v":31},20,{"$f":"[5]Summary!$AP$31","v":17},22,null,null,{"$f":"[5]Summary!$T$5","v":69},{"$f":"[5]Summary!$AP$11","v":54},2,{"$f":"[5]Summary!$AP$30","v":31},21,null,null,{"$f":"[5]Summary!$U$7","v":"Tranmere (H) W 2-1"}]
[]
[]
[null,null,null,null,null,null,"x"]
[null,"Game","Competition",null,"Pts","Pos","Millwall","Pos","top","Pos","3rd","Pos","20th","Pos","Bottom","Pos","Bottom","Pos","Day","2nd","Pos","21st","Pos",null,null,"Vesus"]
[null,1,"Division 2","Chesterfield (H) W 3-1",null,null,2,6,2,1,2,2,0,20,0,22,null,null,1,2,2,0,21,null,null,"Chesterfield (H) W 3-1"]
[null,2,"Division 2","Tranmere (A) L 0-2",null,null,2,11,4,1,4,2,0,20,0,22,null,null,2,4,2,0,21,null,null,"Tranmere (A) L 0-2"]
[null,3,"Division 2","Swansea (A) D 1-1",null,null,3,12,6,1,5,2,0,20,0,22,null,null,6,6,2,0,21,null,null,"Swansea (A) D 1-1"]
{"$rows_left_out":41}
{"sheet":"Sheet3","index":4,"n_rows":154,"n_cols":57,"rows_kept":154,"cut":false,"hidden":false,"merged":[[8,1,10,1],[17,1,19,1],[18,52,20,52],[23,52,25,52],[27,1,29,1],[28,52,30,52],[33,52,35,52],[37,1,39,1],[38,52,40,52],[43,52,45,52],[47,1,49,1],[48,52,50,52],[53,52,55,52],[57,1,59,1],[58,52,60,52],[63,52,65,52],[67,1,69,1],[68,52,70,52],[73,52,75,52],[77,1,79,1],[78,52,80,52],[83,52,85,52],[87,1,89,1],[88,52,90,52],[93,52,95,52],[97,1,99,1],[98,52,100,52],[103,52,105,52],[107,1,109,1],[108,52,110,52],[133,52,135,52],[137,1,139,1],[113,52,115,52],[117,1,119,1],[118,52,120,52],[123,52,125,52],[127,1,129,1],[128,52,130,52]]}
[]
[null,null,null,null,null,null,null,null,null,null,null,null,null,null,null,null,null,null,null,null,null,null,null,null,null,null,null,null,null,null,null,null,null,null,null,null,null,null,null,null,null,null,null,null,null,null,null,null,null,null,null,null,null,null,null,4,46]
[]
[]
[]
[null,null,"Points",null,null,null,null,null,null,null,null,null,null,null,null,null,null,null,null,null,null,null,null,null,null,null,null,null,null,null,null,null,null,null,null,null,null,null,null,null,null,null,null,null,null,null,null,null,null,null,null,"Position"]
[]
[]
{"$rows_left_out":146}